{"text_format":"1","workbook":"xlsx","n_sheets":9,"sheets":["Instructivo","DEMANDA ANUAL","VOLUMEN DE QUEJAS","COSTO ADMINISTRACIÓN PÚBLICA","RESUMEN DE COSTOS AP","AUXILIAR COSTO ADMINISTRACIÓN","TIEMPO DE RESPUESTA","CANAL ATENCIÓN","RESUMEN"],"not_rendered":{"charts":0,"images":7,"macros":1,"external_links":1,"defined_names":4,"comments":5,"pivot_tables":0},"unopened":[],"bounds":{"document_bytes":16777216,"sheet_cells":100000,"rows_first":2000,"rows_last":500,"rows_between":2000,"halvings":0,"cell_chars":16384,"cell_head_chars":4096},"cells_cut":0,"cells_raw":0,"read":"whole","date_system":"1900"}

{"sheet":"Instructivo","index":0,"n_rows":70,"n_cols":1,"rows_kept":70,"cut":false,"hidden":false,"merged":[]}
["CRITERIO DE PRIORIZACIÓN DE TRÁMITES ADMINISTRATIVOS"]
["Instructivo"]
["Consideraciones generales"]
[]
["En las hojas “COSTO DE ADMINISTRACIÓN PÚBLICA”y “RESUMEN”  para añadir más trámites y que apliquen las fórmulas, se deberá seleccionar la primera fila y copiarla una por cada trámite de la entidad"]
[]
["Todas las hojas tienen columnas de color celeste, en las cuales NO deben ingresar valores ya que contienen fórmulas."]
["Para la carga en GOB.EC. La institución debe recordar que el peso máximo del archivo es de 2 MB."]
["Esquema de puntuación"]
["Para priorizar un trámite, se realizará un análisis de criterios básicos y adicionales basado en información que disponen las instituciones sujetas a esta norma técnica. Cada criterio será puntuado según los lineamientos presentes en esta norma."]
["a) Demanda Anual"]
["Considerará el volumen o frecuencia de las solicitudes que ingresan al año a cada institución para la gestión de un trámite en particular."]
["La identificación del volumen anual de los trámites se realizará a través de sus registros de transacciones y/o el número de visitas de consulta de información realizadas a través de páginas web institucionales."]
["Para realizar el registro realice lo siguiente:"]
["1.- Seleccione la hoja DEMANDA ANUAL"]
{"$rows_left_out":56}
{"sheet":"DEMANDA ANUAL","index":1,"n_rows":166,"n_cols":4,"rows_kept":166,"cut":false,"hidden":false,"merged":[[0,0,0,3],[1,0,1,3]]}
["PRIORIZACIÓN DE TRÁMITES ADMINISTRATIVOS"]
["DEMANDA ANUAL"]
[]
["IDENTIFICADOR","TRÁMITE","DEMANDA ANUAL","PUNTAJE"]
["MTOP-007-03-05","Actualización de datos de Matrícula de Operadores Portuarios de Buque",{"$f":"VLOOKUP(A5,'[1] Reporte mensual atenciones y q'!$A$4:$AB$165,27,FALSE)","v":0},0]
["MTOP-007-04-05","Actualización de datos de Matrícula de Operadores Portuarios de Carga",{"$f":"VLOOKUP(A6,'[1] Reporte mensual atenciones y q'!$A$4:$AB$165,27,FALSE)","v":0},0]
["MTOP-007-01-05","Actualización de datos de Matrícula de Operadores Portuarios de Pasajeros",{"$f":"VLOOKUP(A7,'[1] Reporte mensual atenciones y q'!$A$4:$AB$165,27,FALSE)","v":0},0]
["MTOP-007-01-06","Actualización de Registros de Operadores Portuarios de Pasajeros",{"$f":"VLOOKUP(A8,'[1] Reporte mensual atenciones y q'!$A$4:$AB$165,27,FALSE)","v":0},0]
["MTOP-007-01-04","Actualización de Representante Legal de Operadores Portuarios de Pasajeros",{"$f":"VLOOKUP(A9,'[1] Reporte mensual atenciones y q'!$A$4:$AB$165,27,FALSE)","v":0},0]
["MTOP-007-02-04","Actualización de Representante Legal de Operadores Portuarios de Servicios Conexos",{"$f":"VLOOKUP(A10,'[1] Reporte mensual atenciones y q'!$A$4:$AB$165,27,FALSE)","v":0},0]
["MTOP-007-03-03","Ampliación de Servicios de Operadores Portuarios de Buque",{"$f":"VLOOKUP(A11,'[1] Reporte mensual atenciones y q'!$A$4:$AB$165,27,FALSE)","v":0},0]
["MTOP-007-01-03","Ampliación de Servicios de Operadores Portuarios de Pasajeros",{"$f":"VLOOKUP(A12,'[1] Reporte mensual atenciones y q'!$A$4:$AB$165,27,FALSE)","v":0},0]
["MTOP-006-01-04","Aprobación de Plan de Contingencia Zonal para Control de Derrame por Hidrocarburos o Productos Quimicos",{"$f":"VLOOKUP(A13,'[1] Reporte mensual atenciones y q'!$A$4:$AB$165,27,FALSE)","v":0},0]
["MTOP-035-02-01","Aprobación de Planos por Contrato de Fletamento, Arrendamiento, Asociación, Leasing, Fletamento a Casco Desnudo (DENTRO DEL PERIMETRO URBANO)",{"$f":"VLOOKUP(A14,'[1] Reporte mensual atenciones y q'!$A$4:$AB$165,27,FALSE)","v":0},0]
["MTOP-035-02-02","Aprobación de Planos por Contrato de Fletamento, Arrendamiento, Asociación, Leasing, Fletamento a Casco Desnudo (FUERA DEL PERIMETRO URBANO)",{"$f":"VLOOKUP(A15,'[1] Reporte mensual atenciones y q'!$A$4:$AB$165,27,FALSE)","v":0},0]
{"$rows_left_out":152}
{"sheet":"VOLUMEN DE QUEJAS","index":2,"n_rows":166,"n_cols":6,"rows_kept":166,"cut":false,"hidden":false,"merged":[[0,0,0,5],[1,0,1,5]]}
["PRIORIZACIÓN DE TRÁMITES ADMINISTRATIVOS"]
["VOLUMEN DE QUEJAS"]
[]
["IDENTIFICADOR","TRÁMITE","VOLUMEN DEMANDA","VOLUMEN DE QUEJAS","PORCENTAJE","PUNTUACIÓN"]
["MTOP-007-03-05","Actualización de datos de Matrícula de Operadores Portuarios de Buque",0,{"$f":"VLOOKUP(A5,'[1] Reporte mensual atenciones y q'!$A$4:$AB$165,28,FALSE)","v":0},0,0]
["MTOP-007-04-05","Actualización de datos de Matrícula de Operadores Portuarios de Carga",0,{"$f":"VLOOKUP(A6,'[1] Reporte mensual atenciones y q'!$A$4:$AB$165,28,FALSE)","v":0},0,0]
["MTOP-007-01-05","Actualización de datos de Matrícula de Operadores Portuarios de Pasajeros",0,{"$f":"VLOOKUP(A7,'[1] Reporte mensual atenciones y q'!$A$4:$AB$165,28,FALSE)","v":0},0,0]
["MTOP-007-01-06","Actualización de Registros de Operadores Portuarios de Pasajeros",0,{"$f":"VLOOKUP(A8,'[1] Reporte mensual atenciones y q'!$A$4:$AB$165,28,FALSE)","v":0},0,0]
["MTOP-007-01-04","Actualización de Representante Legal de Operadores Portuarios de Pasajeros",0,{"$f":"VLOOKUP(A9,'[1] Reporte mensual atenciones y q'!$A$4:$AB$165,28,FALSE)","v":0},0,0]
["MTOP-007-02-04","Actualización de Representante Legal de Operadores Portuarios de Servicios Conexos",0,{"$f":"VLOOKUP(A10,'[1] Reporte mensual atenciones y q'!$A$4:$AB$165,28,FALSE)","v":0},0,0]
["MTOP-007-03-03","Ampliación de Servicios de Operadores Portuarios de Buque",0,{"$f":"VLOOKUP(A11,'[1] Reporte mensual atenciones y q'!$A$4:$AB$165,28,FALSE)","v":0},0,0]
["MTOP-007-01-03","Ampliación de Servicios de Operadores Portuarios de Pasajeros",0,{"$f":"VLOOKUP(A12,'[1] Reporte mensual atenciones y q'!$A$4:$AB$165,28,FALSE)","v":0},0,0]
["MTOP-006-01-04","Aprobación de Plan de Contingencia Zonal para Control de Derrame por Hidrocarburos o Productos Quimicos",0,{"$f":"VLOOKUP(A13,'[1] Reporte mensual atenciones y q'!$A$4:$AB$165,28,FALSE)","v":0},0,0]
["MTOP-035-02-01","Aprobación de Planos por Contrato de Fletamento, Arrendamiento, Asociación, Leasing, Fletamento a Casco Desnudo (DENTRO DEL PERIMETRO URBANO)",0,{"$f":"VLOOKUP(A14,'[1] Reporte mensual atenciones y q'!$A$4:$AB$165,28,FALSE)","v":0},0,0]
["MTOP-035-02-02","Aprobación de Planos por Contrato de Fletamento, Arrendamiento, Asociación, Leasing, Fletamento a Casco Desnudo (FUERA DEL PERIMETRO URBANO)",0,{"$f":"VLOOKUP(A15,'[1] Reporte mensual atenciones y q'!$A$4:$AB$165,28,FALSE)","v":0},0,0]
{"$rows_left_out":152}
{"sheet":"COSTO ADMINISTRACIÓN PÚBLICA","index":3,"n_rows":167,"n_cols":10,"rows_kept":167,"cut":false,"hidden":false,"merged":[[0,0,0,5],[1,0,1,5],[3,0,4,0],[3,1,4,1],[3,2,3,4],[3,5,4,5]]}
["PRIORIZACIÓN DE TRÁMITES ADMINISTRATIVOS"]
["COSTOS PARA LA ADMINISTRACIÓN PÚBLICA"]
[]
["IDENTIFICADOR","TRÁMITE","INSUMOS PARA COSTO",null,null,"COSTO PARA LA ADM. PÚBLICA",null,"SBU",400]
[null,null,"TIEMPO (HORAS)","COSTO PERSONAL","COSTO RECURSOS"]
["MTOP-007-03-05","Actualización de datos de Matrícula de Operadores Portuarios de Buque",{"$f":"1220/60","v":20.333333333333332},{"$f":"C6*$I$4/160","v":50.833333333333329},3,{"$f":"D6+E6","v":53.833333333333329}]
["MTOP-007-04-05","Actualización de datos de Matrícula de Operadores Portuarios de Carga",{"$f":"1220/60","v":20.333333333333332},{"$f":"C7*$I$4/160","v":50.833333333333329},3,{"$f":"D7+E7","v":53.833333333333329}]
["MTOP-007-01-05","Actualización de datos de Matrícula de Operadores Portuarios de Pasajeros",{"$f":"2880/60","v":48},120,3,123]
["MTOP-007-01-06","Actualización de Registros de Operadores Portuarios de Pasajeros",48,120,3,123]
["MTOP-007-01-04","Actualización de Representante Legal de Operadores Portuarios de Pasajeros",48,120,3,123]
["MTOP-007-02-04","Actualización de Representante Legal de Operadores Portuarios de Servicios Conexos",48,120,0.35,120.35]
["MTOP-007-03-03","Ampliación de Servicios de Operadores Portuarios de Buque",{"$f":"1220/60","v":20.333333333333332},50.833333333333329,0.35,51.18333333333333]
["MTOP-007-01-03","Ampliación de Servicios de Operadores Portuarios de Pasajeros",{"$f":"2880/60","v":48},120,0.35,120.35]
["MTOP-006-01-04","Aprobación de Plan de Contingencia Zonal para Control de Derrame por Hidrocarburos o Productos Quimicos",{"$f":"2000/60","v":33.333333333333336},83.333333333333343,0.35,83.683333333333337]
["MTOP-035-02-01","Aprobación de Planos por Contrato de Fletamento, Arrendamiento, Asociación, Leasing, Fletamento a Casco Desnudo (DENTRO DEL PERIMETRO URBANO)",{"$f":"7200/60","v":120},300,0.35,300.35000000000002]
{"$rows_left_out":153}
{"sheet":"RESUMEN DE COSTOS AP","index":4,"n_rows":166,"n_cols":4,"rows_kept":166,"cut":false,"hidden":false,"merged":[[0,0,0,5],[1,0,1,5]]}
["PRIORIZACIÓN DE TRÁMITES ADMINISTRATIVOS"]
["COSTOS PARA LA ADMINISTRACIÓN PÚBLICA"]
[]
["IDENTIFICADOR","TRÁMITE","COSTO PARA LA ADM. PÚBLICA","PUNTUACIÓN"]
["MTOP-013-01-01","Emisión de Certificado de Operación Regular",6.75,5]
["MTOP-009-02-06","Autorización de Fondeo en Terminales Petroleros",7,5]
["MTOP-028-02-01","Emisión del Certificado de Inspección de Estado Rector de Puerto a naves de bandera extranjera que ingresan al país en tránsito (dejan carga y retiran carga de puertos del país)",10.5,5]
["MTOP-020-03-01","Autorización de Trayectoria Interna de Embarcaciones entre Puertos Nacionales",40.08,5]
["MTOP-010-02-04","Autorización a Buques De Bandera Nacional e Internacional Para Realizar Viajes Extraordinarios Para Puertos Internacionales",40.25,5]
["MTOP-015-02-02","Certificación de Títulos de Prácticos",40.35,5]
["MTOP-015-02-03","Autorización de Entrenamiento para los Aspirantes a Capitanes de Amarre y Control de Carga",43,5]
["MTOP-015-02-01","Autorización de Entrenamiento para los Aspirantes a Prácticos",43,5]
["MTOP-010-02-08","Autorización de Rutas, Horarios e Itinerarios de los Servicios Públicos del Transporte Marítimo",43,5]
["MTOP-001-01-05","Certificación de la propiedad, gravámenes, arrendamiento mercantil y venta con reserva de dominio",43,5]
["MTOP-001-01-04","Certificación de matrícula por perdida de equipo caminero y maquinaria pesada",43,5]
{"$rows_left_out":152}
{"sheet":"AUXILIAR COSTO ADMINISTRACIÓN","index":5,"n_rows":20,"n_cols":3,"rows_kept":20,"cut":false,"hidden":false,"merged":[[1,1,1,2]]}
[]
["TRÁMITE:"]
["NO.","ACTIVIDAD","TIEMPO (HORAS)"]
[1]
[2]
[3]
[4]
[5]
[6]
[7]
[8]
[9]
[10]
[11]
[12]
{"$rows_left_out":6}
{"sheet":"TIEMPO DE RESPUESTA","index":6,"n_rows":166,"n_cols":4,"rows_kept":166,"cut":false,"hidden":false,"merged":[[0,0,0,3],[1,0,1,3]]}
["PRIORIZACIÓN DE TRÁMITES ADMINISTRATIVOS"]
["TIEMPO DE RESPUESTA"]
[]
["IDENTIFICADOR","TRÁMITE","TIEMPO RESPUESTA (horas laborables)","PUNTUACIÓN"]
["MTOP-007-03-05","Actualización de datos de Matrícula de Operadores Portuarios de Buque",{"$f":"1220/60","v":20.333333333333332},0]
["MTOP-007-04-05","Actualización de datos de Matrícula de Operadores Portuarios de Carga",{"$f":"1220/60","v":20.333333333333332},0]
["MTOP-007-01-05","Actualización de datos de Matrícula de Operadores Portuarios de Pasajeros",{"$f":"2880/60","v":48},30]
["MTOP-007-01-06","Actualización de Registros de Operadores Portuarios de Pasajeros",48,30]
["MTOP-007-01-04","Actualización de Representante Legal de Operadores Portuarios de Pasajeros",48,30]
["MTOP-007-02-04","Actualización de Representante Legal de Operadores Portuarios de Servicios Conexos",48,30]
["MTOP-007-03-03","Ampliación de Servicios de Operadores Portuarios de Buque",{"$f":"1220/60","v":20.333333333333332},0]
["MTOP-007-01-03","Ampliación de Servicios de Operadores Portuarios de Pasajeros",{"$f":"2880/60","v":48},30]
["MTOP-006-01-04","Aprobación de Plan de Contingencia Zonal para Control de Derrame por Hidrocarburos o Productos Quimicos",{"$f":"2000/60","v":33.333333333333336},0]
["MTOP-035-02-01","Aprobación de Planos por Contrato de Fletamento, Arrendamiento, Asociación, Leasing, Fletamento a Casco Desnudo (DENTRO DEL PERIMETRO URBANO)",{"$f":"7200/60","v":120},30]
["MTOP-035-02-02","Aprobación de Planos por Contrato de Fletamento, Arrendamiento, Asociación, Leasing, Fletamento a Casco Desnudo (FUERA DEL PERIMETRO URBANO)",{"$f":"7200/60","v":120},30]
{"$rows_left_out":152}
{"sheet":"CANAL ATENCIÓN","index":7,"n_rows":166,"n_cols":12,"rows_kept":166,"cut":false,"hidden":false,"merged":[[0,0,0,3],[1,0,1,3]]}
["PRIORIZACIÓN DE TRÁMITES ADMINISTRATIVOS"]
["CANAL DE ATENCIÓN"]
[null,null,null,null,null,null,null,null,"Totalmente en Línea",null,null,0]
["IDENTIFICADOR","TRÁMITE","CANAL ATENCIÓN","PUNTUACIÓN",null,null,null,null,"No se completa totalmente en línea.",null,null,10]
["MTOP-007-03-05","Actualización de datos de Matrícula de Operadores Portuarios de Buque","No se completa totalmente en línea.",{"$f":"IF(ISBLANK(C5),\"\",IF(C5=\"Totalmente en línea\",0,IF(C5=\"Inicia en línea\",6,10)))","v":10}]
["MTOP-007-04-05","Actualización de datos de Matrícula de Operadores Portuarios de Carga","No se completa totalmente en línea.",{"$f":"IF(ISBLANK(C6),\"\",IF(C6=\"Totalmente en línea\",0,IF(C6=\"Inicia en línea\",6,10)))","v":10}]
["MTOP-007-01-05","Actualización de datos de Matrícula de Operadores Portuarios de Pasajeros","No se completa totalmente en línea.",10]
["MTOP-007-01-06","Actualización de Registros de Operadores Portuarios de Pasajeros","No se completa totalmente en línea.",10]
["MTOP-007-01-04","Actualización de Representante Legal de Operadores Portuarios de Pasajeros","No se completa totalmente en línea.",10]
["MTOP-007-02-04","Actualización de Representante Legal de Operadores Portuarios de Servicios Conexos","No se completa totalmente en línea.",10]
["MTOP-007-03-03","Ampliación de Servicios de Operadores Portuarios de Buque","No se completa totalmente en línea.",10]
["MTOP-007-01-03","Ampliación de Servicios de Operadores Portuarios de Pasajeros","No se completa totalmente en línea.",10]
["MTOP-006-01-04","Aprobación de Plan de Contingencia Zonal para Control de Derrame por Hidrocarburos o Productos Quimicos","No se completa totalmente en línea.",10]
["MTOP-035-02-01","Aprobación de Planos por Contrato de Fletamento, Arrendamiento, Asociación, Leasing, Fletamento a Casco Desnudo (DENTRO DEL PERIMETRO URBANO)","No se completa totalmente en línea.",10]
["MTOP-035-02-02","Aprobación de Planos por Contrato de Fletamento, Arrendamiento, Asociación, Leasing, Fletamento a Casco Desnudo (FUERA DEL PERIMETRO URBANO)","No se completa totalmente en línea.",10]
{"$rows_left_out":152}
{"sheet":"RESUMEN","index":8,"n_rows":165,"n_cols":25,"rows_kept":165,"cut":false,"hidden":false,"merged":[[1,9,1,10],[1,11,1,12],[1,13,2,13],[0,2,0,6],[0,7,0,12],[1,5,2,5],[1,6,2,6],[1,7,1,8],[1,0,2,0],[1,1,2,1],[1,2,2,2],[1,3,2,3],[1,4,2,4]]}
[null,null,"BÁSICOS",null,null,null,null,"ADICIONALES"]
["ID trámite","Nombre del trámite","Demanda","Quejas","Costo para administración","Tiempo de respuesta","Canal de atención","Necesidades ciudadanas",null,"Susceptibilidad a corrupción",null,"Volumen de devoluciones",null,"PUNTAJE TOTAL"]
[null,null,null,null,null,null,null,"Criterio","Puntuación","Criterio","Puntuación","Criterio","Puntuación",null,null,null,null,null,null,null,"demanda",0,3,6,10]
["MTOP-007-03-05","Actualización de datos de Matrícula de Operadores Portuarios de Buque",{"$f":"VLOOKUP(A4,'DEMANDA ANUAL'!$A$5:$D$166,4,FALSE)","v":0},{"$f":"VLOOKUP(A4,'VOLUMEN DE QUEJAS'!$A$5:$F$166,6,FALSE)","v":0},{"$f":"VLOOKUP(A4,'RESUMEN DE COSTOS AP'!$A$5:$D$164,4,FALSE)","v":5},{"$f":"VLOOKUP(A4,'TIEMPO DE RESPUESTA'!$A$5:$D$166,4,FALSE)","v":0},{"$f":"VLOOKUP(A4,'CANAL ATENCIÓN'!$A$5:$D$166,4,FALSE)","v":10},"NO",{"$f":"IF(H4=\"SI\",5,0)","v":0},"NO",{"$f":"IF(J4=\"SI\",10,0)","v":0},"NO",{"$f":"IF(L4=\"SI\",5,0)","v":0},{"$f":"SUM(C4:G4,I4,K4,M4)","v":15},null,null,null,null,null,null,"quejas",0,4,10]
["MTOP-007-04-05","Actualización de datos de Matrícula de Operadores Portuarios de Carga",{"$f":"VLOOKUP(A5,'DEMANDA ANUAL'!$A$5:$D$166,4,FALSE)","v":0},{"$f":"VLOOKUP(A5,'VOLUMEN DE QUEJAS'!$A$5:$F$166,6,FALSE)","v":0},{"$f":"VLOOKUP(A5,'RESUMEN DE COSTOS AP'!$A$5:$D$164,4,FALSE)","v":5},{"$f":"VLOOKUP(A5,'TIEMPO DE RESPUESTA'!$A$5:$D$166,4,FALSE)","v":0},{"$f":"VLOOKUP(A5,'CANAL ATENCIÓN'!$A$5:$D$166,4,FALSE)","v":10},"NO",{"$f":"IF(H5=\"SI\",5,0)","v":0},"NO",{"$f":"IF(J5=\"SI\",10,0)","v":0},"NO",{"$f":"IF(L5=\"SI\",5,0)","v":0},{"$f":"SUM(C5:G5,I5,K5,M5)","v":15},null,null,null,null,null,null,"cpa",5,10,20]
["MTOP-007-01-05","Actualización de datos de Matrícula de Operadores Portuarios de Pasajeros",{"$f":"VLOOKUP(A6,'DEMANDA ANUAL'!$A$5:$D$166,4,FALSE)","v":0},{"$f":"VLOOKUP(A6,'VOLUMEN DE QUEJAS'!$A$5:$F$166,6,FALSE)","v":0},{"$f":"VLOOKUP(A6,'RESUMEN DE COSTOS AP'!$A$5:$D$164,4,FALSE)","v":10},{"$f":"VLOOKUP(A6,'TIEMPO DE RESPUESTA'!$A$5:$D$166,4,FALSE)","v":30},{"$f":"VLOOKUP(A6,'CANAL ATENCIÓN'!$A$5:$D$166,4,FALSE)","v":10},"NO",0,"NO",0,"NO",0,50,null,null,null,null,null,null,"tr",0,30]
["MTOP-007-01-06","Actualización de Registros de Operadores Portuarios de Pasajeros",{"$f":"VLOOKUP(A7,'DEMANDA ANUAL'!$A$5:$D$166,4,FALSE)","v":0},{"$f":"VLOOKUP(A7,'VOLUMEN DE QUEJAS'!$A$5:$F$166,6,FALSE)","v":0},{"$f":"VLOOKUP(A7,'RESUMEN DE COSTOS AP'!$A$5:$D$164,4,FALSE)","v":10},{"$f":"VLOOKUP(A7,'TIEMPO DE RESPUESTA'!$A$5:$D$166,4,FALSE)","v":30},{"$f":"VLOOKUP(A7,'CANAL ATENCIÓN'!$A$5:$D$166,4,FALSE)","v":10},"NO",0,"NO",0,"NO",0,50,null,null,null,null,null,null,"ca",0,10]
["MTOP-007-01-04","Actualización de Representante Legal de Operadores Portuarios de Pasajeros",{"$f":"VLOOKUP(A8,'DEMANDA ANUAL'!$A$5:$D$166,4,FALSE)","v":0},{"$f":"VLOOKUP(A8,'VOLUMEN DE QUEJAS'!$A$5:$F$166,6,FALSE)","v":0},{"$f":"VLOOKUP(A8,'RESUMEN DE COSTOS AP'!$A$5:$D$164,4,FALSE)","v":10},{"$f":"VLOOKUP(A8,'TIEMPO DE RESPUESTA'!$A$5:$D$166,4,FALSE)","v":30},{"$f":"VLOOKUP(A8,'CANAL ATENCIÓN'!$A$5:$D$166,4,FALSE)","v":10},"NO",0,"NO",0,"NO",0,50,null,null,null,null,null,null,null,"SI","NO"]
["MTOP-007-02-04","Actualización de Representante Legal de Operadores Portuarios de Servicios Conexos",{"$f":"VLOOKUP(A9,'DEMANDA ANUAL'!$A$5:$D$166,4,FALSE)","v":0},{"$f":"VLOOKUP(A9,'VOLUMEN DE QUEJAS'!$A$5:$F$166,6,FALSE)","v":0},{"$f":"VLOOKUP(A9,'RESUMEN DE COSTOS AP'!$A$5:$D$164,4,FALSE)","v":10},{"$f":"VLOOKUP(A9,'TIEMPO DE RESPUESTA'!$A$5:$D$166,4,FALSE)","v":30},{"$f":"VLOOKUP(A9,'CANAL ATENCIÓN'!$A$5:$D$166,4,FALSE)","v":10},"NO",0,"NO",0,"NO",0,50]
["MTOP-007-03-03","Ampliación de Servicios de Operadores Portuarios de Buque",{"$f":"VLOOKUP(A10,'DEMANDA ANUAL'!$A$5:$D$166,4,FALSE)","v":0},{"$f":"VLOOKUP(A10,'VOLUMEN DE QUEJAS'!$A$5:$F$166,6,FALSE)","v":0},{"$f":"VLOOKUP(A10,'RESUMEN DE COSTOS AP'!$A$5:$D$164,4,FALSE)","v":5},{"$f":"VLOOKUP(A10,'TIEMPO DE RESPUESTA'!$A$5:$D$166,4,FALSE)","v":0},{"$f":"VLOOKUP(A10,'CANAL ATENCIÓN'!$A$5:$D$166,4,FALSE)","v":10},"NO",0,"NO",0,"NO",0,15]
["MTOP-007-01-03","Ampliación de Servicios de Operadores Portuarios de Pasajeros",{"$f":"VLOOKUP(A11,'DEMANDA ANUAL'!$A$5:$D$166,4,FALSE)","v":0},{"$f":"VLOOKUP(A11,'VOLUMEN DE QUEJAS'!$A$5:$F$166,6,FALSE)","v":0},{"$f":"VLOOKUP(A11,'RESUMEN DE COSTOS AP'!$A$5:$D$164,4,FALSE)","v":10},{"$f":"VLOOKUP(A11,'TIEMPO DE RESPUESTA'!$A$5:$D$166,4,FALSE)","v":30},{"$f":"VLOOKUP(A11,'CANAL ATENCIÓN'!$A$5:$D$166,4,FALSE)","v":10},"NO",0,"NO",0,"NO",0,50]
["MTOP-006-01-04","Aprobación de Plan de Contingencia Zonal para Control de Derrame por Hidrocarburos o Productos Quimicos",{"$f":"VLOOKUP(A12,'DEMANDA ANUAL'!$A$5:$D$166,4,FALSE)","v":0},{"$f":"VLOOKUP(A12,'VOLUMEN DE QUEJAS'!$A$5:$F$166,6,FALSE)","v":0},{"$f":"VLOOKUP(A12,'RESUMEN DE COSTOS AP'!$A$5:$D$164,4,FALSE)","v":10},{"$f":"VLOOKUP(A12,'TIEMPO DE RESPUESTA'!$A$5:$D$166,4,FALSE)","v":0},{"$f":"VLOOKUP(A12,'CANAL ATENCIÓN'!$A$5:$D$166,4,FALSE)","v":10},"NO",0,"NO",0,"NO",0,20]
["MTOP-035-02-01","Aprobación de Planos por Contrato de Fletamento, Arrendamiento, Asociación, Leasing, Fletamento a Casco Desnudo (DENTRO DEL PERIMETRO URBANO)",{"$f":"VLOOKUP(A13,'DEMANDA ANUAL'!$A$5:$D$166,4,FALSE)","v":0},{"$f":"VLOOKUP(A13,'VOLUMEN DE QUEJAS'!$A$5:$F$166,6,FALSE)","v":0},{"$f":"VLOOKUP(A13,'RESUMEN DE COSTOS AP'!$A$5:$D$164,4,FALSE)","v":20},{"$f":"VLOOKUP(A13,'TIEMPO DE RESPUESTA'!$A$5:$D$166,4,FALSE)","v":30},{"$f":"VLOOKUP(A13,'CANAL ATENCIÓN'!$A$5:$D$166,4,FALSE)","v":10},"NO",0,"NO",0,"NO",0,60]
["MTOP-035-02-02","Aprobación de Planos por Contrato de Fletamento, Arrendamiento, Asociación, Leasing, Fletamento a Casco Desnudo (FUERA DEL PERIMETRO URBANO)",{"$f":"VLOOKUP(A14,'DEMANDA ANUAL'!$A$5:$D$166,4,FALSE)","v":0},{"$f":"VLOOKUP(A14,'VOLUMEN DE QUEJAS'!$A$5:$F$166,6,FALSE)","v":0},{"$f":"VLOOKUP(A14,'RESUMEN DE COSTOS AP'!$A$5:$D$164,4,FALSE)","v":20},{"$f":"VLOOKUP(A14,'TIEMPO DE RESPUESTA'!$A$5:$D$166,4,FALSE)","v":30},{"$f":"VLOOKUP(A14,'CANAL ATENCIÓN'!$A$5:$D$166,4,FALSE)","v":10},"NO",0,"NO",0,"NO",0,60]
["MTOP-035-02-03","Aprobación de Planos por Contrato de Fletamento, Arrendamiento, Asociación, Leasing, Fletamento a Casco Desnudo (GALAPAGOS ESMERALDAS AMAZONIA)",{"$f":"VLOOKUP(A15,'DEMANDA ANUAL'!$A$5:$D$166,4,FALSE)","v":0},{"$f":"VLOOKUP(A15,'VOLUMEN DE QUEJAS'!$A$5:$F$166,6,FALSE)","v":0},{"$f":"VLOOKUP(A15,'RESUMEN DE COSTOS AP'!$A$5:$D$164,4,FALSE)","v":20},{"$f":"VLOOKUP(A15,'TIEMPO DE RESPUESTA'!$A$5:$D$166,4,FALSE)","v":30},{"$f":"VLOOKUP(A15,'CANAL ATENCIÓN'!$A$5:$D$166,4,FALSE)","v":10},"NO",0,"NO",0,"NO",0,60]
{"$rows_left_out":150}