{"text_format":"1","workbook":"xlsx","n_sheets":9,"sheets":["Instructivo","DEMANDA ANUAL","VOLUMEN DE QUEJAS","COSTO ADMINISTRACIÓN PÚBLICA","RESUMEN DE COSTOS AP","AUXILIAR COSTO ADMINISTRACIÓN","TIEMPO DE RESPUESTA","CANAL ATENCIÓN","RESUMEN"],"not_rendered":{"charts":0,"images":7,"macros":1,"external_links":1,"defined_names":0,"comments":5,"pivot_tables":0},"unopened":[],"bounds":{"document_bytes":16777216,"sheet_cells":100000,"rows_first":2000,"rows_last":500,"rows_between":2000,"halvings":0,"cell_chars":16384,"cell_head_chars":4096},"cells_cut":0,"cells_raw":0,"read":"whole","date_system":"1900"}

{"sheet":"Instructivo","index":0,"n_rows":70,"n_cols":1,"rows_kept":70,"cut":false,"hidden":false,"merged":[]}
["CRITERIO DE PRIORIZACIÓN DE TRÁMITES ADMINISTRATIVOS"]
["Instructivo"]
["Consideraciones generales"]
[]
["En las hojas “COSTO DE ADMINISTRACIÓN PÚBLICA”y “RESUMEN”  para añadir más trámites y que apliquen las fórmulas, se deberá seleccionar la primera fila y copiarla una por cada trámite de la entidad"]
[]
["Todas las hojas tienen columnas de color celeste, en las cuales NO deben ingresar valores ya que contienen fórmulas."]
["Para la carga en GOB.EC. La institución debe recordar que el peso máximo del archivo es de 2 MB."]
["Esquema de puntuación"]
["Para priorizar un trámite, se realizará un análisis de criterios básicos y adicionales basado en información que disponen las instituciones sujetas a esta norma técnica. Cada criterio será puntuado según los lineamientos presentes en esta norma."]
["a) Demanda Anual"]
["Considerará el volumen o frecuencia de las solicitudes que ingresan al año a cada institución para la gestión de un trámite en particular."]
["La identificación del volumen anual de los trámites se realizará a través de sus registros de transacciones y/o el número de visitas de consulta de información realizadas a través de páginas web institucionales."]
["Para realizar el registro realice lo siguiente:"]
["1.- Seleccione la hoja DEMANDA ANUAL"]
{"$rows_left_out":56}
{"sheet":"DEMANDA ANUAL","index":1,"n_rows":81,"n_cols":4,"rows_kept":81,"cut":false,"hidden":false,"merged":[[0,0,0,3],[1,0,1,3]]}
["PRIORIZACIÓN DE TRÁMITES ADMINISTRATIVOS"]
["DEMANDA ANUAL"]
[]
["IDENTIFICADOR","TRÁMITE","DEMANDA ANUAL","PUNTAJE"]
["DGRCIC-002-01-08","Inscripción de hijos de progenitoras del mismo sexo por reproducción asistida",0,0]
["DGRCIC-002-02-02","Inscripción de nacimiento por adopción en el exterior",0,0]
["DGRCIC-012-02-01","Registro de género en Consulados",0,0]
["DGRCIC-002-04-03","Registro de naturalización de hijos de padres naturalizados",0,0]
["DGRCIC-002-04-01","Registro de naturalización por carta de naturalización",0,0]
["DGRCIC-008-01-03","Validación Contra Base de Datos",0,0]
["DGRCIC-003-01-13","Solemnización de matrimonio fuera de sede de registro civil si uno de los contrayentes se encuentra privado de la libertad",4,3]
["DGRCIC-008-01-01","Web service - Demográfico",8,3]
["DGRCIC-003-01-11","Solemnización de matrimonio fuera de sede de registro civil si uno o los dos contrayentes son viudos y tienen hijo/s menor/es de edad",46,3]
["DGRCIC-002-01-07","Inscripción de nacimiento por adopción",60,3]
["DGRCIC-003-01-17","Solemnización de matrimonio fuera de sede de registro civil si uno o ambos contrayentes son extranjeros con condición migratoria de residencia temporal",73,3]
{"$rows_left_out":67}
{"sheet":"VOLUMEN DE QUEJAS","index":2,"n_rows":81,"n_cols":6,"rows_kept":81,"cut":false,"hidden":false,"merged":[[0,0,0,5],[1,0,1,5]]}
["PRIORIZACIÓN DE TRÁMITES ADMINISTRATIVOS"]
["VOLUMEN DE QUEJAS"]
[]
["IDENTIFICADOR","TRÁMITE","VOLUMEN DEMANDA","VOLUMEN DE QUEJAS","PORCENTAJE","PUNTUACIÓN"]
["DGRCIC-002-01-08","Inscripción de hijos de progenitoras del mismo sexo por reproducción asistida",0,0,0,0]
["DGRCIC-002-02-02","Inscripción de nacimiento por adopción en el exterior",0,0,0,0]
["DGRCIC-012-02-01","Registro de género en Consulados",0,0,0,0]
["DGRCIC-002-04-03","Registro de naturalización de hijos de padres naturalizados",0,0,0,0]
["DGRCIC-002-04-01","Registro de naturalización por carta de naturalización",0,0,0,0]
["DGRCIC-008-01-03","Validación Contra Base de Datos",0,0,0,0]
["DGRCIC-003-01-13","Solemnización de matrimonio fuera de sede de registro civil si uno de los contrayentes se encuentra privado de la libertad",4,0,0,0]
["DGRCIC-008-01-01","Web service - Demográfico",8,0,0,0]
["DGRCIC-003-01-11","Solemnización de matrimonio fuera de sede de registro civil si uno o los dos contrayentes son viudos y tienen hijo/s menor/es de edad",46,0,0,0]
["DGRCIC-002-01-07","Inscripción de nacimiento por adopción",60,0,0,0]
["DGRCIC-003-01-17","Solemnización de matrimonio fuera de sede de registro civil si uno o ambos contrayentes son extranjeros con condición migratoria de residencia temporal",73,0,0,0]
{"$rows_left_out":67}
{"sheet":"COSTO ADMINISTRACIÓN PÚBLICA","index":3,"n_rows":82,"n_cols":13,"rows_kept":82,"cut":false,"hidden":false,"merged":[[0,0,0,5],[1,0,1,5],[3,0,4,0],[3,1,4,1],[3,2,3,4],[3,5,4,5]]}
["PRIORIZACIÓN DE TRÁMITES ADMINISTRATIVOS"]
["COSTOS PARA LA ADMINISTRACIÓN PÚBLICA"]
[]
["IDENTIFICADOR","TRÁMITE","INSUMOS PARA COSTO",null,null,"COSTO PARA LA ADM. PÚBLICA",null,"SBU",400]
[null,null,"TIEMPO (HORAS)","COSTO PERSONAL","COSTO RECURSOS"]
["DGRCIC-002-01-08","Inscripción de hijos de progenitoras del mismo sexo por reproducción asistida",0.16500000000000001,{"$f":"C6*$I$4/160","v":0.41249999999999998},0,{"$f":"D6+E6","v":0.41249999999999998},null,null,null,null,null,{"$f":"VLOOKUP(A6,'[1]COSTO ADMINISTRACIÓN PÚBLICA'!$A$6:$C$82,3,0)","v":0.16500000000000001},{"$f":"VLOOKUP(A6,'[1]COSTO ADMINISTRACIÓN PÚBLICA'!$A$6:$F$82,5,0)","v":0}]
["DGRCIC-002-02-02","Inscripción de nacimiento por adopción en el exterior",0.16500000000000001,{"$f":"C7*$I$4/160","v":0.41249999999999998},0,{"$f":"D7+E7","v":0.41249999999999998},null,null,null,null,null,{"$f":"VLOOKUP(A7,'[1]COSTO ADMINISTRACIÓN PÚBLICA'!$A$6:$C$82,3,0)","v":0.16500000000000001},{"$f":"VLOOKUP(A7,'[1]COSTO ADMINISTRACIÓN PÚBLICA'!$A$6:$F$82,5,0)","v":0}]
["DGRCIC-012-02-01","Registro de género en Consulados",0,{"$f":"C8*$I$4/160","v":0},0,{"$f":"D8+E8","v":0},null,null,null,null,null,{"$f":"VLOOKUP(A8,'[1]COSTO ADMINISTRACIÓN PÚBLICA'!$A$6:$C$82,3,0)","v":0},{"$f":"VLOOKUP(A8,'[1]COSTO ADMINISTRACIÓN PÚBLICA'!$A$6:$F$82,5,0)","v":0}]
["DGRCIC-002-04-03","Registro de naturalización de hijos de padres naturalizados",0.16500000000000001,0.41249999999999998,0,0.41249999999999998,null,null,null,null,null,{"$f":"VLOOKUP(A9,'[1]COSTO ADMINISTRACIÓN PÚBLICA'!$A$6:$C$82,3,0)","v":0.16500000000000001},{"$f":"VLOOKUP(A9,'[1]COSTO ADMINISTRACIÓN PÚBLICA'!$A$6:$F$82,5,0)","v":0}]
["DGRCIC-002-04-01","Registro de naturalización por carta de naturalización",0.16500000000000001,0.41249999999999998,0,0.41249999999999998,null,null,null,null,null,{"$f":"VLOOKUP(A10,'[1]COSTO ADMINISTRACIÓN PÚBLICA'!$A$6:$C$82,3,0)","v":0.16500000000000001},{"$f":"VLOOKUP(A10,'[1]COSTO ADMINISTRACIÓN PÚBLICA'!$A$6:$F$82,5,0)","v":0}]
["DGRCIC-008-01-03","Validación Contra Base de Datos",0,0,0,0,null,null,null,null,null,{"$f":"VLOOKUP(A11,'[1]COSTO ADMINISTRACIÓN PÚBLICA'!$A$6:$C$82,3,0)","v":0},{"$f":"VLOOKUP(A11,'[1]COSTO ADMINISTRACIÓN PÚBLICA'!$A$6:$F$82,5,0)","v":0}]
["DGRCIC-003-01-13","Solemnización de matrimonio fuera de sede de registro civil si uno de los contrayentes se encuentra privado de la libertad",0.2486111111111112,0.62152777777777801,11.774698067396146,12.396225845173925,null,null,null,null,null,{"$f":"VLOOKUP(A12,'[1]COSTO ADMINISTRACIÓN PÚBLICA'!$A$6:$C$82,3,0)","v":0.2486111111111112},{"$f":"VLOOKUP(A12,'[1]COSTO ADMINISTRACIÓN PÚBLICA'!$A$6:$F$82,5,0)","v":11.774698067396146}]
["DGRCIC-008-01-01","Web service - Demográfico",0,0,0,0,null,null,null,null,null,{"$f":"VLOOKUP(A13,'[1]COSTO ADMINISTRACIÓN PÚBLICA'!$A$6:$C$82,3,0)","v":0},{"$f":"VLOOKUP(A13,'[1]COSTO ADMINISTRACIÓN PÚBLICA'!$A$6:$F$82,5,0)","v":0}]
["DGRCIC-003-01-11","Solemnización de matrimonio fuera de sede de registro civil si uno o los dos contrayentes son viudos y tienen hijo/s menor/es de edad",0.2486111111111112,0.62152777777777801,11.774698067396145,12.396225845173923,null,null,null,null,null,{"$f":"VLOOKUP(A14,'[1]COSTO ADMINISTRACIÓN PÚBLICA'!$A$6:$C$82,3,0)","v":0.2486111111111112},{"$f":"VLOOKUP(A14,'[1]COSTO ADMINISTRACIÓN PÚBLICA'!$A$6:$F$82,5,0)","v":11.774698067396145}]
["DGRCIC-002-01-07","Inscripción de nacimiento por adopción",0.16500000000000001,0.41249999999999998,8.4612597691438047,8.8737597691438044,null,null,null,null,null,{"$f":"VLOOKUP(A15,'[1]COSTO ADMINISTRACIÓN PÚBLICA'!$A$6:$C$82,3,0)","v":0.16500000000000001},{"$f":"VLOOKUP(A15,'[1]COSTO ADMINISTRACIÓN PÚBLICA'!$A$6:$F$82,5,0)","v":8.4612597691438047}]
{"$rows_left_out":68}
{"sheet":"RESUMEN DE COSTOS AP","index":4,"n_rows":81,"n_cols":4,"rows_kept":81,"cut":false,"hidden":false,"merged":[[0,0,0,5],[1,0,1,5]]}
["PRIORIZACIÓN DE TRÁMITES ADMINISTRATIVOS"]
["COSTOS PARA LA ADMINISTRACIÓN PÚBLICA"]
[]
["IDENTIFICADOR","TRÁMITE","COSTO PARA LA ADM. PÚBLICA","PUNTUACIÓN"]
["DGRCIC-012-02-01","Registro de género en Consulados",0,0]
["DGRCIC-008-01-02","Sistema Nacional de Identificación Ciudadana - Consulta de Cédula de Papel",0,0]
["DGRCIC-008-01-03","Validación Contra Base de Datos",0,0]
["DGRCIC-008-01-01","Web service - Demográfico",0,0]
["DGRCIC-007-02-02","Convalidación de Documentos Registrales",0.18251705653021441,5]
["DGRCIC-007-01-08","Emisión de Certificado de Identidad y Estado Civil en línea",0.18251705653021441,5]
["DGRCIC-002-01-08","Inscripción de hijos de progenitoras del mismo sexo por reproducción asistida",0.41249999999999998,5]
["DGRCIC-002-02-02","Inscripción de nacimiento por adopción en el exterior",0.41249999999999998,5]
["DGRCIC-002-04-03","Registro de naturalización de hijos de padres naturalizados",0.41249999999999998,5]
["DGRCIC-002-04-01","Registro de naturalización por carta de naturalización",0.41249999999999998,5]
["DGRCIC-005-01-08","Inscripción de defunción por desastres, conflictos armados y epidemias",0.50902777777777797,5]
{"$rows_left_out":67}
{"sheet":"AUXILIAR COSTO ADMINISTRACIÓN","index":5,"n_rows":20,"n_cols":3,"rows_kept":20,"cut":false,"hidden":false,"merged":[[1,1,1,2]]}
[]
["TRÁMITE:"]
["NO.","ACTIVIDAD","TIEMPO (HORAS)"]
[1]
[2]
[3]
[4]
[5]
[6]
[7]
[8]
[9]
[10]
[11]
[12]
{"$rows_left_out":6}
{"sheet":"TIEMPO DE RESPUESTA","index":6,"n_rows":81,"n_cols":10,"rows_kept":81,"cut":false,"hidden":false,"merged":[[0,0,0,3],[1,0,1,3]]}
["PRIORIZACIÓN DE TRÁMITES ADMINISTRATIVOS"]
["TIEMPO DE RESPUESTA"]
[]
["IDENTIFICADOR","TRÁMITE","TIEMPO RESPUESTA (horas laborables)","PUNTUACIÓN"]
["DGRCIC-002-01-08","Inscripción de hijos de progenitoras del mismo sexo por reproducción asistida",0.626388888888888,0,null,null,null,null,null,{"$f":"+VLOOKUP(A5,'[1]TIEMPO DE RESPUESTA'!$A$5:$C$81,3,0)","v":0.626388888888888}]
["DGRCIC-002-02-02","Inscripción de nacimiento por adopción en el exterior",0.626388888888888,0,null,null,null,null,null,{"$f":"+VLOOKUP(A6,'[1]TIEMPO DE RESPUESTA'!$A$5:$C$81,3,0)","v":0.626388888888888}]
["DGRCIC-012-02-01","Registro de género en Consulados",1.3,0,null,null,null,null,null,{"$f":"+VLOOKUP(A7,'[1]TIEMPO DE RESPUESTA'!$A$5:$C$81,3,0)","v":1.3}]
["DGRCIC-002-04-03","Registro de naturalización de hijos de padres naturalizados",0.626388888888888,0,null,null,null,null,null,{"$f":"+VLOOKUP(A8,'[1]TIEMPO DE RESPUESTA'!$A$5:$C$81,3,0)","v":0.626388888888888}]
["DGRCIC-002-04-01","Registro de naturalización por carta de naturalización",0.626388888888888,0,null,null,null,null,null,{"$f":"+VLOOKUP(A9,'[1]TIEMPO DE RESPUESTA'!$A$5:$C$81,3,0)","v":0.626388888888888}]
["DGRCIC-008-01-03","Validación Contra Base de Datos",0,null,null,null,null,null,null,{"$f":"+VLOOKUP(A10,'[1]TIEMPO DE RESPUESTA'!$A$5:$C$81,3,0)","v":0}]
["DGRCIC-003-01-13","Solemnización de matrimonio fuera de sede de registro civil si uno de los contrayentes se encuentra privado de la libertad",0.75660901467505204,null,null,null,null,null,null,{"$f":"+VLOOKUP(A11,'[1]TIEMPO DE RESPUESTA'!$A$5:$C$81,3,0)","v":0.75660901467505204}]
["DGRCIC-008-01-01","Web service - Demográfico",0,null,null,null,null,null,null,{"$f":"+VLOOKUP(A12,'[1]TIEMPO DE RESPUESTA'!$A$5:$C$81,3,0)","v":0}]
["DGRCIC-003-01-11","Solemnización de matrimonio fuera de sede de registro civil si uno o los dos contrayentes son viudos y tienen hijo/s menor/es de edad",0.75660901467505204,null,null,null,null,null,null,{"$f":"+VLOOKUP(A13,'[1]TIEMPO DE RESPUESTA'!$A$5:$C$81,3,0)","v":0.75660901467505204}]
["DGRCIC-002-01-07","Inscripción de nacimiento por adopción",0.626388888888888,null,null,null,null,null,null,{"$f":"+VLOOKUP(A14,'[1]TIEMPO DE RESPUESTA'!$A$5:$C$81,3,0)","v":0.626388888888888}]
["DGRCIC-003-01-17","Solemnización de matrimonio fuera de sede de registro civil si uno o ambos contrayentes son extranjeros con condición migratoria de residencia temporal",0.75660901467505204,null,null,null,null,null,null,{"$f":"+VLOOKUP(A15,'[1]TIEMPO DE RESPUESTA'!$A$5:$C$81,3,0)","v":0.75660901467505204}]
{"$rows_left_out":67}
{"sheet":"CANAL ATENCIÓN","index":7,"n_rows":81,"n_cols":13,"rows_kept":81,"cut":false,"hidden":false,"merged":[[0,0,0,3],[1,0,1,3]]}
["PRIORIZACIÓN DE TRÁMITES ADMINISTRATIVOS"]
["CANAL DE ATENCIÓN"]
[null,null,null,null,null,null,null,null,"Totalmente en Línea",null,null,0]
["IDENTIFICADOR","TRÁMITE","CANAL ATENCIÓN","PUNTUACIÓN",null,null,null,null,"No se completa totalmente en línea.",null,null,10]
["DGRCIC-002-01-08","Inscripción de hijos de progenitoras del mismo sexo por reproducción asistida","Presencial",{"$f":"IF(ISBLANK(C5),\"\",IF(C5=\"Totalmente en línea\",0,IF(C5=\"Inicia en línea\",6,10)))","v":10},null,null,null,null,null,null,null,null,{"$f":"VLOOKUP(A5,'[1]CANAL ATENCIÓN'!$A$5:$D$81,3,0)","v":"Presencial"}]
["DGRCIC-002-02-02","Inscripción de nacimiento por adopción en el exterior","Inicia en Línea",{"$f":"IF(ISBLANK(C6),\"\",IF(C6=\"Totalmente en línea\",0,IF(C6=\"Inicia en línea\",6,10)))","v":6},null,null,null,null,null,null,null,null,{"$f":"VLOOKUP(A6,'[1]CANAL ATENCIÓN'!$A$5:$D$81,3,0)","v":"Inicia en Línea"}]
["DGRCIC-012-02-01","Registro de género en Consulados","Presencial",10,null,null,null,null,null,null,null,null,{"$f":"VLOOKUP(A7,'[1]CANAL ATENCIÓN'!$A$5:$D$81,3,0)","v":"Presencial"}]
["DGRCIC-002-04-03","Registro de naturalización de hijos de padres naturalizados","Presencial",10,null,null,null,null,null,null,null,null,{"$f":"VLOOKUP(A8,'[1]CANAL ATENCIÓN'!$A$5:$D$81,3,0)","v":"Presencial"}]
["DGRCIC-002-04-01","Registro de naturalización por carta de naturalización","Presencial",10,null,null,null,null,null,null,null,null,{"$f":"VLOOKUP(A9,'[1]CANAL ATENCIÓN'!$A$5:$D$81,3,0)","v":"Presencial"}]
["DGRCIC-008-01-03","Validación Contra Base de Datos","Totalmente en Línea",0,null,null,null,null,null,null,null,null,{"$f":"VLOOKUP(A10,'[1]CANAL ATENCIÓN'!$A$5:$D$81,3,0)","v":"Totalmente en Línea"}]
["DGRCIC-003-01-13","Solemnización de matrimonio fuera de sede de registro civil si uno de los contrayentes se encuentra privado de la libertad","Inicia en Línea",6,null,null,null,null,null,null,null,null,{"$f":"VLOOKUP(A11,'[1]CANAL ATENCIÓN'!$A$5:$D$81,3,0)","v":"Inicia en Línea"}]
["DGRCIC-008-01-01","Web service - Demográfico","Totalmente en Línea",0,null,null,null,null,null,null,null,null,{"$f":"VLOOKUP(A12,'[1]CANAL ATENCIÓN'!$A$5:$D$81,3,0)","v":"Totalmente en Línea"}]
["DGRCIC-003-01-11","Solemnización de matrimonio fuera de sede de registro civil si uno o los dos contrayentes son viudos y tienen hijo/s menor/es de edad","Inicia en Línea",6,null,null,null,null,null,null,null,null,{"$f":"VLOOKUP(A13,'[1]CANAL ATENCIÓN'!$A$5:$D$81,3,0)","v":"Inicia en Línea"}]
["DGRCIC-002-01-07","Inscripción de nacimiento por adopción","Presencial",10,null,null,null,null,null,null,null,null,{"$f":"VLOOKUP(A14,'[1]CANAL ATENCIÓN'!$A$5:$D$81,3,0)","v":"Presencial"}]
["DGRCIC-003-01-17","Solemnización de matrimonio fuera de sede de registro civil si uno o ambos contrayentes son extranjeros con condición migratoria de residencia temporal","Inicia en Línea",6,null,null,null,null,null,null,null,null,{"$f":"VLOOKUP(A15,'[1]CANAL ATENCIÓN'!$A$5:$D$81,3,0)","v":"Inicia en Línea"}]
{"$rows_left_out":67}
{"sheet":"RESUMEN","index":8,"n_rows":80,"n_cols":36,"rows_kept":80,"cut":false,"hidden":false,"merged":[[1,9,1,10],[1,11,1,12],[1,13,2,13],[0,2,0,6],[0,7,0,12],[1,5,2,5],[1,6,2,6],[1,7,1,8],[1,0,2,0],[1,1,2,1],[1,2,2,2],[1,3,2,3],[1,4,2,4],[1,25,2,25],[1,16,2,16],[1,17,2,17],[1,18,2,18],[1,19,2,19],[1,20,2,20]]}
[null,null,"BÁSICOS",null,null,null,null,"ADICIONALES"]
["ID trámite","Nombre del trámite","Demanda","Quejas","Costo para administración","Tiempo de respuesta","Canal de atención","Necesidades ciudadanas",null,"Susceptibilidad a corrupción",null,"Volumen de devoluciones",null,"PUNTAJE TOTAL",null,null,"Demanda","Quejas","Costo para administración","Tiempo de respuesta","Canal de atención",null,null,null,null,"Canal de atención"]
[null,null,null,null,null,null,null,"Criterio","Puntuación","Criterio","Puntuación","Criterio","Puntuación",null,null,null,null,null,null,null,null,0,3,6,10,null,null,null,"ID trámite","Nombre del trámite","Demanda","Quejas","Costo para administración","Tiempo de respuesta","Canal de atención","PUNTAJE TOTAL"]
["DGRCIC-002-01-08","Inscripción de hijos de progenitoras del mismo sexo por reproducción asistida",0,0,0.41249999999999998,0,10,"NO",{"$f":"IF(H4=\"SI\",5,0)","v":0},"NO",{"$f":"IF(J4=\"SI\",10,0)","v":0},"NO",{"$f":"IF(L4=\"SI\",5,0)","v":0},{"$f":"SUM(C4:G4,I4,K4,M4)","v":10.4125},null,null,{"$f":"VLOOKUP(A4,'DEMANDA ANUAL'!$A$5:$D$81,4,0)","v":0},{"$f":"VLOOKUP(A4,'VOLUMEN DE QUEJAS'!$A$5:$F$81,6,0)","v":0},{"$f":"VLOOKUP(A4,'COSTO ADMINISTRACIÓN PÚBLICA'!$A$6:$F$82,6,0)","v":0.41249999999999998},{"$f":"VLOOKUP(A4,'TIEMPO DE RESPUESTA'!$A$5:$D$81,4,0)","v":0},"quejas",0,4,10,null,{"$f":"VLOOKUP(A4,'CANAL ATENCIÓN'!$A$5:$D$81,4,0)","v":10},null,null,"DGRCIC-002-01-08","Inscripción de hijos de progenitoras del mismo sexo por reproducción asistida",0,0,0.41249999999999998,0,10,10.4125]
["DGRCIC-002-02-02","Inscripción de nacimiento por adopción en el exterior",0,0,0.41249999999999998,0,6,"NO",{"$f":"IF(H5=\"SI\",5,0)","v":0},"NO",{"$f":"IF(J5=\"SI\",10,0)","v":0},"NO",{"$f":"IF(L5=\"SI\",5,0)","v":0},{"$f":"SUM(C5:G5,I5,K5,M5)","v":6.4124999999999996},null,null,{"$f":"VLOOKUP(A5,'DEMANDA ANUAL'!$A$5:$D$81,4,0)","v":0},{"$f":"VLOOKUP(A5,'VOLUMEN DE QUEJAS'!$A$5:$F$81,6,0)","v":0},{"$f":"VLOOKUP(A5,'COSTO ADMINISTRACIÓN PÚBLICA'!$A$6:$F$82,6,0)","v":0.41249999999999998},{"$f":"VLOOKUP(A5,'TIEMPO DE RESPUESTA'!$A$5:$D$81,4,0)","v":0},"cpa",5,10,20,null,{"$f":"VLOOKUP(A5,'CANAL ATENCIÓN'!$A$5:$D$81,4,0)","v":6},null,null,"DGRCIC-002-02-02","Inscripción de nacimiento por adopción en el exterior",0,0,0.41249999999999998,0,6,6.4124999999999996]
["DGRCIC-012-02-01","Registro de género en Consulados",0,0,0,0,10,"NO",0,"NO",0,"NO",0,10,null,null,{"$f":"VLOOKUP(A6,'DEMANDA ANUAL'!$A$5:$D$81,4,0)","v":0},{"$f":"VLOOKUP(A6,'VOLUMEN DE QUEJAS'!$A$5:$F$81,6,0)","v":0},{"$f":"VLOOKUP(A6,'COSTO ADMINISTRACIÓN PÚBLICA'!$A$6:$F$82,6,0)","v":0},{"$f":"VLOOKUP(A6,'TIEMPO DE RESPUESTA'!$A$5:$D$81,4,0)","v":0},"tr",0,30,null,null,{"$f":"VLOOKUP(A6,'CANAL ATENCIÓN'!$A$5:$D$81,4,0)","v":10},null,null,"DGRCIC-012-02-01","Registro de género en Consulados",0,0,0,0,10,10]
["DGRCIC-002-04-03","Registro de naturalización de hijos de padres naturalizados",0,0,0.41249999999999998,0,10,"NO",0,"NO",0,"NO",0,10.4125,null,null,{"$f":"VLOOKUP(A7,'DEMANDA ANUAL'!$A$5:$D$81,4,0)","v":0},{"$f":"VLOOKUP(A7,'VOLUMEN DE QUEJAS'!$A$5:$F$81,6,0)","v":0},{"$f":"VLOOKUP(A7,'COSTO ADMINISTRACIÓN PÚBLICA'!$A$6:$F$82,6,0)","v":0.41249999999999998},{"$f":"VLOOKUP(A7,'TIEMPO DE RESPUESTA'!$A$5:$D$81,4,0)","v":0},"ca",0,10,null,null,{"$f":"VLOOKUP(A7,'CANAL ATENCIÓN'!$A$5:$D$81,4,0)","v":10},null,null,"DGRCIC-002-04-03","Registro de naturalización de hijos de padres naturalizados",0,0,0.41249999999999998,0,10,10.4125]
["DGRCIC-002-04-01","Registro de naturalización por carta de naturalización",0,0,0.41249999999999998,0,10,"NO",0,"NO",0,"NO",0,10.4125,null,null,{"$f":"VLOOKUP(A8,'DEMANDA ANUAL'!$A$5:$D$81,4,0)","v":0},{"$f":"VLOOKUP(A8,'VOLUMEN DE QUEJAS'!$A$5:$F$81,6,0)","v":0},{"$f":"VLOOKUP(A8,'COSTO ADMINISTRACIÓN PÚBLICA'!$A$6:$F$82,6,0)","v":0.41249999999999998},{"$f":"VLOOKUP(A8,'TIEMPO DE RESPUESTA'!$A$5:$D$81,4,0)","v":0},null,"SI","NO",null,null,{"$f":"VLOOKUP(A8,'CANAL ATENCIÓN'!$A$5:$D$81,4,0)","v":10},null,null,"DGRCIC-002-04-01","Registro de naturalización por carta de naturalización",0,0,0.41249999999999998,0,10,10.4125]
["DGRCIC-008-01-03","Validación Contra Base de Datos",0,0,0,0,0,"NO",0,"NO",0,"NO",0,0,null,null,{"$f":"VLOOKUP(A9,'DEMANDA ANUAL'!$A$5:$D$81,4,0)","v":0},{"$f":"VLOOKUP(A9,'VOLUMEN DE QUEJAS'!$A$5:$F$81,6,0)","v":0},{"$f":"VLOOKUP(A9,'COSTO ADMINISTRACIÓN PÚBLICA'!$A$6:$F$82,6,0)","v":0},{"$f":"VLOOKUP(A9,'TIEMPO DE RESPUESTA'!$A$5:$D$81,4,0)","v":0},null,null,null,null,null,{"$f":"VLOOKUP(A9,'CANAL ATENCIÓN'!$A$5:$D$81,4,0)","v":0},null,null,"DGRCIC-008-01-03","Validación Contra Base de Datos",0,0,0,0,0,0]
["DGRCIC-003-01-13","Solemnización de matrimonio fuera de sede de registro civil si uno de los contrayentes se encuentra privado de la libertad",3,0,12.396225845173925,0,6,"NO",0,"NO",0,"NO",0,21.396225845173923,null,null,{"$f":"VLOOKUP(A10,'DEMANDA ANUAL'!$A$5:$D$81,4,0)","v":3},{"$f":"VLOOKUP(A10,'VOLUMEN DE QUEJAS'!$A$5:$F$81,6,0)","v":0},{"$f":"VLOOKUP(A10,'COSTO ADMINISTRACIÓN PÚBLICA'!$A$6:$F$82,6,0)","v":12.396225845173925},{"$f":"VLOOKUP(A10,'TIEMPO DE RESPUESTA'!$A$5:$D$81,4,0)","v":0},null,null,null,null,null,{"$f":"VLOOKUP(A10,'CANAL ATENCIÓN'!$A$5:$D$81,4,0)","v":6},null,null,"DGRCIC-003-01-13","Solemnización de matrimonio fuera de sede de registro civil si uno de los contrayentes se encuentra privado de la libertad",3,0,12.396225845173925,0,6,21.396225845173923]
["DGRCIC-008-01-01","Web service - Demográfico",3,0,0,0,0,"NO",0,"NO",0,"NO",0,3,null,null,{"$f":"VLOOKUP(A11,'DEMANDA ANUAL'!$A$5:$D$81,4,0)","v":3},{"$f":"VLOOKUP(A11,'VOLUMEN DE QUEJAS'!$A$5:$F$81,6,0)","v":0},{"$f":"VLOOKUP(A11,'COSTO ADMINISTRACIÓN PÚBLICA'!$A$6:$F$82,6,0)","v":0},{"$f":"VLOOKUP(A11,'TIEMPO DE RESPUESTA'!$A$5:$D$81,4,0)","v":0},null,null,null,null,null,{"$f":"VLOOKUP(A11,'CANAL ATENCIÓN'!$A$5:$D$81,4,0)","v":0},null,null,"DGRCIC-008-01-01","Web service - Demográfico",3,0,0,0,0,3]
["DGRCIC-003-01-11","Solemnización de matrimonio fuera de sede de registro civil si uno o los dos contrayentes son viudos y tienen hijo/s menor/es de edad",3,0,12.396225845173923,0,6,"NO",0,"NO",0,"NO",0,21.396225845173923,null,null,{"$f":"VLOOKUP(A12,'DEMANDA ANUAL'!$A$5:$D$81,4,0)","v":3},{"$f":"VLOOKUP(A12,'VOLUMEN DE QUEJAS'!$A$5:$F$81,6,0)","v":0},{"$f":"VLOOKUP(A12,'COSTO ADMINISTRACIÓN PÚBLICA'!$A$6:$F$82,6,0)","v":12.396225845173923},{"$f":"VLOOKUP(A12,'TIEMPO DE RESPUESTA'!$A$5:$D$81,4,0)","v":0},null,null,null,null,null,{"$f":"VLOOKUP(A12,'CANAL ATENCIÓN'!$A$5:$D$81,4,0)","v":6},null,null,"DGRCIC-003-01-11","Solemnización de matrimonio fuera de sede de registro civil si uno o los dos contrayentes son viudos y tienen hijo/s menor/es de edad",3,0,12.396225845173923,0,6,21.396225845173923]
["DGRCIC-002-01-07","Inscripción de nacimiento por adopción",3,0,8.8737597691438044,0,10,"NO",0,"NO",0,"NO",0,21.873759769143803,null,null,{"$f":"VLOOKUP(A13,'DEMANDA ANUAL'!$A$5:$D$81,4,0)","v":3},{"$f":"VLOOKUP(A13,'VOLUMEN DE QUEJAS'!$A$5:$F$81,6,0)","v":0},{"$f":"VLOOKUP(A13,'COSTO ADMINISTRACIÓN PÚBLICA'!$A$6:$F$82,6,0)","v":8.8737597691438044},{"$f":"VLOOKUP(A13,'TIEMPO DE RESPUESTA'!$A$5:$D$81,4,0)","v":0},null,null,null,null,null,{"$f":"VLOOKUP(A13,'CANAL ATENCIÓN'!$A$5:$D$81,4,0)","v":10},null,null,"DGRCIC-002-01-07","Inscripción de nacimiento por adopción",3,0,8.8737597691438044,0,10,21.873759769143803]
["DGRCIC-003-01-17","Solemnización de matrimonio fuera de sede de registro civil si uno o ambos contrayentes son extranjeros con condición migratoria de residencia temporal",3,0,12.396225845173923,0,6,"NO",0,"NO",0,"NO",0,21.396225845173923,null,null,{"$f":"VLOOKUP(A14,'DEMANDA ANUAL'!$A$5:$D$81,4,0)","v":3},{"$f":"VLOOKUP(A14,'VOLUMEN DE QUEJAS'!$A$5:$F$81,6,0)","v":0},{"$f":"VLOOKUP(A14,'COSTO ADMINISTRACIÓN PÚBLICA'!$A$6:$F$82,6,0)","v":12.396225845173923},{"$f":"VLOOKUP(A14,'TIEMPO DE RESPUESTA'!$A$5:$D$81,4,0)","v":0},null,null,null,null,null,{"$f":"VLOOKUP(A14,'CANAL ATENCIÓN'!$A$5:$D$81,4,0)","v":6},null,null,"DGRCIC-003-01-17","Solemnización de matrimonio fuera de sede de registro civil si uno o ambos contrayentes son extranjeros con condición migratoria de residencia temporal",3,0,12.396225845173923,0,6,21.396225845173923]
["DGRCIC-008-01-02","Sistema Nacional de Identificación Ciudadana - Consulta de Cédula de Papel",3,0,0,0,0,"NO",0,"NO",0,"NO",0,3,null,null,{"$f":"VLOOKUP(A15,'DEMANDA ANUAL'!$A$5:$D$81,4,0)","v":3},{"$f":"VLOOKUP(A15,'VOLUMEN DE QUEJAS'!$A$5:$F$81,6,0)","v":0},{"$f":"VLOOKUP(A15,'COSTO ADMINISTRACIÓN PÚBLICA'!$A$6:$F$82,6,0)","v":0},{"$f":"VLOOKUP(A15,'TIEMPO DE RESPUESTA'!$A$5:$D$81,4,0)","v":0},null,null,null,null,null,{"$f":"VLOOKUP(A15,'CANAL ATENCIÓN'!$A$5:$D$81,4,0)","v":0},null,null,"DGRCIC-008-01-02","Sistema Nacional de Identificación Ciudadana - Consulta de Cédula de Papel",3,0,0,0,0,3]
{"$rows_left_out":65}