{"text_format":"1","workbook":"xlsx","n_sheets":9,"sheets":["Instructivo","DEMANDA ANUAL","VOLUMEN DE QUEJAS","COSTO ADMINISTRACIÓN PÚBLICA","RESUMEN DE COSTOS AP","AUXILIAR COSTO ADMINISTRACIÓN","TIEMPO DE RESPUESTA","CANAL ATENCIÓN","RESUMEN"],"not_rendered":{"charts":0,"images":7,"macros":1,"external_links":0,"defined_names":0,"comments":5,"pivot_tables":0},"unopened":[],"bounds":{"document_bytes":16777216,"sheet_cells":100000,"rows_first":2000,"rows_last":500,"rows_between":2000,"halvings":0,"cell_chars":16384,"cell_head_chars":4096},"cells_cut":0,"cells_raw":0,"read":"whole","date_system":"1900"}

{"sheet":"Instructivo","index":0,"n_rows":70,"n_cols":1,"rows_kept":70,"cut":false,"hidden":false,"merged":[]}
["CRITERIO DE PRIORIZACIÓN DE TRÁMITES ADMINISTRATIVOS"]
["Instructivo"]
["Consideraciones generales"]
[]
["En las hojas “COSTO DE ADMINISTRACIÓN PÚBLICA”y “RESUMEN”  para añadir más trámites y que apliquen las fórmulas, se deberá seleccionar la primera fila y copiarla una por cada trámite de la entidad"]
[]
["Todas las hojas tienen columnas de color celeste, en las cuales NO deben ingresar valores ya que contienen fórmulas."]
["Para la carga en GOB.EC. La institución debe recordar que el peso máximo del archivo es de 2 MB."]
["Esquema de puntuación"]
["Para priorizar un trámite, se realizará un análisis de criterios básicos y adicionales basado en información que disponen las instituciones sujetas a esta norma técnica. Cada criterio será puntuado según los lineamientos presentes en esta norma."]
["a) Demanda Anual"]
["Considerará el volumen o frecuencia de las solicitudes que ingresan al año a cada institución para la gestión de un trámite en particular."]
["La identificación del volumen anual de los trámites se realizará a través de sus registros de transacciones y/o el número de visitas de consulta de información realizadas a través de páginas web institucionales."]
["Para realizar el registro realice lo siguiente:"]
["1.- Seleccione la hoja DEMANDA ANUAL"]
{"$rows_left_out":56}
{"sheet":"DEMANDA ANUAL","index":1,"n_rows":127,"n_cols":4,"rows_kept":127,"cut":false,"hidden":false,"merged":[[0,0,0,3],[1,0,1,3]]}
["PRIORIZACIÓN DE TRÁMITES ADMINISTRATIVOS"]
["DEMANDA ANUAL"]
[]
["IDENTIFICADOR","TRÁMITE","DEMANDA ANUAL","PUNTAJE"]
["MINTUR-001-07-06","Actualización de Datos del Registro de Turismo para Centros Turísticos Comunitarios Persona Jurídica",0.0,0.0]
["MINTUR-001-06-04","Actualización de Datos del Registro de Turismo para Hipódromos y Parques de Atracciones Estables",0.0,0.0]
["MINTUR-001-05-28","Actualización de Datos del Registro de Turismo para Transporte Turístico Aéreo",0.0,0.0]
["MINTUR-001-05-18","Actualización de Datos del Registro de Turismo para Transporte Turístico Marítimo Continente",0.0,0.0]
["MINTUR-001-05-13","Actualización de Datos del Registro de Turismo para Transporte Turístico Marítimo de Galápagos Persona Natural o Jurídica",0.0,0.0]
["MINTUR-001-08-58","Actualización de información asociada a la Credencial de Registro de Turismo de Continente y Galápagos",0.0,0.0]
["MINTUR-004-02-09","Asesoría para la obtención de dictámenes de viabilidad técnica y evaluación de proyectos de desarrollo de destinos turísticos.",0.0,0.0]
["MINTUR-006-03-02","Coordinación para la Participación de eventos, ferias y campañas de promoción turística del destino Ecuador",0.0,0.0]
["MINTUR-001-04-08","Emisión de Certificado de Inhabilitación del Registro de Turismo para Alimentos y Bebidas Persona Jurídica",0.0,0.0]
["MINTUR-001-07-04","Emisión de Certificado de Inhabilitación del Registro de Turismo para Centros Turísticos Comunitarios Persona Jurídica",0.0,0.0]
["MINTUR-001-06-02","Emisión de Certificado de Inhabilitación del Registro de Turismo para Hipódromos y Parques de Atracciones Estables Persona Jurídica",0.0,0.0]
{"$rows_left_out":113}
{"sheet":"VOLUMEN DE QUEJAS","index":2,"n_rows":127,"n_cols":6,"rows_kept":127,"cut":false,"hidden":false,"merged":[[0,0,0,5],[1,0,1,5]]}
["PRIORIZACIÓN DE TRÁMITES ADMINISTRATIVOS"]
["VOLUMEN DE QUEJAS"]
[]
["IDENTIFICADOR","TRÁMITE","VOLUMEN DEMANDA","VOLUMEN DE QUEJAS","PORCENTAJE","PUNTUACIÓN"]
["MINTUR-001-07-06","Actualización de Datos del Registro de Turismo para Centros Turísticos Comunitarios Persona Jurídica",0.0,0.0,0.0,0.0]
["MINTUR-001-06-04","Actualización de Datos del Registro de Turismo para Hipódromos y Parques de Atracciones Estables",0.0,0.0,0.0,0.0]
["MINTUR-001-05-28","Actualización de Datos del Registro de Turismo para Transporte Turístico Aéreo",0.0,0.0,0.0,0.0]
["MINTUR-001-05-18","Actualización de Datos del Registro de Turismo para Transporte Turístico Marítimo Continente",0.0,0.0,0.0,0.0]
["MINTUR-001-05-13","Actualización de Datos del Registro de Turismo para Transporte Turístico Marítimo de Galápagos Persona Natural o Jurídica",0.0,0.0,0.0,0.0]
["MINTUR-001-08-58","Actualización de información asociada a la Credencial de Registro de Turismo de Continente y Galápagos",0.0,0.0,0.0,0.0]
["MINTUR-004-02-09","Asesoría para la obtención de dictámenes de viabilidad técnica y evaluación de proyectos de desarrollo de destinos turísticos.",0.0,0.0,0.0,0.0]
["MINTUR-006-03-02","Coordinación para la Participación de eventos, ferias y campañas de promoción turística del destino Ecuador",0.0,0.0,0.0,0.0]
["MINTUR-001-04-08","Emisión de Certificado de Inhabilitación del Registro de Turismo para Alimentos y Bebidas Persona Jurídica",0.0,0.0,0.0,0.0]
["MINTUR-001-07-04","Emisión de Certificado de Inhabilitación del Registro de Turismo para Centros Turísticos Comunitarios Persona Jurídica",0.0,0.0,0.0,0.0]
["MINTUR-001-06-02","Emisión de Certificado de Inhabilitación del Registro de Turismo para Hipódromos y Parques de Atracciones Estables Persona Jurídica",0.0,0.0,0.0,0.0]
{"$rows_left_out":113}
{"sheet":"COSTO ADMINISTRACIÓN PÚBLICA","index":3,"n_rows":128,"n_cols":9,"rows_kept":128,"cut":false,"hidden":false,"merged":[[0,0,0,5],[1,0,1,5],[3,0,4,0],[3,1,4,1],[3,2,3,4],[3,5,4,5]]}
["PRIORIZACIÓN DE TRÁMITES ADMINISTRATIVOS"]
["COSTOS PARA LA ADMINISTRACIÓN PÚBLICA"]
[]
["IDENTIFICADOR","TRÁMITE","INSUMOS PARA COSTO",null,null,"COSTO PARA LA ADM. PÚBLICA",null,"SBU",400.0]
[null,null,"TIEMPO (HORAS)","COSTO PERSONAL","COSTO RECURSOS"]
["MINTUR-001-07-06","Actualización de Datos del Registro de Turismo para Centros Turísticos Comunitarios Persona Jurídica",8.85,{"$f":"C6*$I$4/160","v":22.125},0.5,{"$f":"D6+E6","v":22.625}]
["MINTUR-001-06-04","Actualización de Datos del Registro de Turismo para Hipódromos y Parques de Atracciones Estables",8.85,22.125,0.5,22.625]
["MINTUR-001-05-28","Actualización de Datos del Registro de Turismo para Transporte Turístico Aéreo",8.85,22.125,0.5,22.625]
["MINTUR-001-05-18","Actualización de Datos del Registro de Turismo para Transporte Turístico Marítimo Continente",8.85,22.125,0.5,22.625]
["MINTUR-001-05-13","Actualización de Datos del Registro de Turismo para Transporte Turístico Marítimo de Galápagos Persona Natural o Jurídica",8.85,22.125,0.5,22.625]
["MINTUR-001-08-58","Actualización de información asociada a la Credencial de Registro de Turismo de Continente y Galápagos",5.2,13,2.25,15.25]
["MINTUR-004-02-09","Asesoría para la obtención de dictámenes de viabilidad técnica y evaluación de proyectos de desarrollo de destinos turísticos.",2.5,6.25,1.0,7.25]
["MINTUR-006-03-02","Coordinación para la Participación de eventos, ferias y campañas de promoción turística del destino Ecuador",7.5,18.75,5.0,23.75]
["MINTUR-001-04-08","Emisión de Certificado de Inhabilitación del Registro de Turismo para Alimentos y Bebidas Persona Jurídica",8.85,22.125,1.5,23.625]
["MINTUR-001-07-04","Emisión de Certificado de Inhabilitación del Registro de Turismo para Centros Turísticos Comunitarios Persona Jurídica",8.85,22.125,1.5,23.625]
{"$rows_left_out":114}
{"sheet":"RESUMEN DE COSTOS AP","index":4,"n_rows":127,"n_cols":4,"rows_kept":127,"cut":false,"hidden":false,"merged":[[0,0,0,5],[1,0,1,5]]}
["PRIORIZACIÓN DE TRÁMITES ADMINISTRATIVOS"]
["COSTOS PARA LA ADMINISTRACIÓN PÚBLICA"]
[]
["IDENTIFICADOR","TRÁMITE","COSTO PARA LA ADM. PÚBLICA","PUNTUACIÓN"]
["MINTUR-001-11-01","Emisión de un Salvoconducto para Tour Líder por servicio prestado en Continente",3.225,5.0]
["MINTUR-005-05-01","Emisión de portafolio de información sobre la oferta actual de transporte turístico: aéreo, fluvial, marítimo, terrestre, puertos y aeropuertos",3.625,5.0]
["MINTUR-005-03-01","Emisión de portafolio de proyectos de inversión turística.",3.625,5.0]
["MINTUR-005-01-01","Emisión del catálogo de la oferta turística del destino Ecuador",3.625,5.0]
["MINTUR-003-01-01","Emisión del catálogo de productos, inventario de facilidades y atractivos turísticos",3.625,5.0]
["MINTUR-006-05-01","Emisión del inventario de contactos de proveedores de servicios para producciones fílmicas",3.625,5.0]
["MINTUR-004-02-11","Asesoramiento en la elaboración y manejo de indicadores para el sector turístico.",4.125,5.0]
["MINTUR-004-02-06","Asesoramiento para la declaración y pago de Contribución Uno por Mil",4.125,5.0]
["MINTUR-004-02-03","Asesoramiento para la elaboración o mejoramiento de proyectos Turísticos",4.125,5.0]
["MINTUR-004-02-08","Asesoramiento sobre Bienestar y Seguridad Turística",4.125,5.0]
["MINTUR-001-11-02","Emisión de un Salvoconducto para Tour Líder por servicio prestado en Galápagos",4.945,5.0]
{"$rows_left_out":113}
{"sheet":"AUXILIAR COSTO ADMINISTRACIÓN","index":5,"n_rows":20,"n_cols":3,"rows_kept":20,"cut":false,"hidden":false,"merged":[[1,1,1,2]]}
[]
["TRÁMITE:"]
["NO.","ACTIVIDAD","TIEMPO (HORAS)"]
[1.0]
[2.0]
[3.0]
[4.0]
[5.0]
[6.0]
[7.0]
[8.0]
[9.0]
[10.0]
[11.0]
[12.0]
{"$rows_left_out":6}
{"sheet":"TIEMPO DE RESPUESTA","index":6,"n_rows":127,"n_cols":4,"rows_kept":127,"cut":false,"hidden":false,"merged":[[0,0,0,3],[1,0,1,3]]}
["PRIORIZACIÓN DE TRÁMITES ADMINISTRATIVOS"]
["TIEMPO DE RESPUESTA"]
[]
["IDENTIFICADOR","TRÁMITE","TIEMPO RESPUESTA (horas laborables)","PUNTUACIÓN"]
["MINTUR-001-07-06","Actualización de Datos del Registro de Turismo para Centros Turísticos Comunitarios Persona Jurídica",40.0,0.0]
["MINTUR-001-06-04","Actualización de Datos del Registro de Turismo para Hipódromos y Parques de Atracciones Estables",40.0,0.0]
["MINTUR-001-05-28","Actualización de Datos del Registro de Turismo para Transporte Turístico Aéreo",40.0,0.0]
["MINTUR-001-05-18","Actualización de Datos del Registro de Turismo para Transporte Turístico Marítimo Continente",40.0,0.0]
["MINTUR-001-05-13","Actualización de Datos del Registro de Turismo para Transporte Turístico Marítimo de Galápagos Persona Natural o Jurídica",40.0,0.0]
["MINTUR-001-08-58","Actualización de información asociada a la Credencial de Registro de Turismo de Continente y Galápagos",8.0,0.0]
["MINTUR-004-02-09","Asesoría para la obtención de dictámenes de viabilidad técnica y evaluación de proyectos de desarrollo de destinos turísticos.",4.0,0.0]
["MINTUR-006-03-02","Coordinación para la Participación de eventos, ferias y campañas de promoción turística del destino Ecuador",8.0,0.0]
["MINTUR-001-04-08","Emisión de Certificado de Inhabilitación del Registro de Turismo para Alimentos y Bebidas Persona Jurídica",35.0,0.0]
["MINTUR-001-07-04","Emisión de Certificado de Inhabilitación del Registro de Turismo para Centros Turísticos Comunitarios Persona Jurídica",40.0,0.0]
["MINTUR-001-06-02","Emisión de Certificado de Inhabilitación del Registro de Turismo para Hipódromos y Parques de Atracciones Estables Persona Jurídica",40.0,0.0]
{"$rows_left_out":113}
{"sheet":"CANAL ATENCIÓN","index":7,"n_rows":127,"n_cols":12,"rows_kept":127,"cut":false,"hidden":false,"merged":[[0,0,0,3],[1,0,1,3]]}
["PRIORIZACIÓN DE TRÁMITES ADMINISTRATIVOS"]
["CANAL DE ATENCIÓN"]
[null,null,null,null,null,null,null,null,"Totalmente en Línea",null,null,0.0]
["IDENTIFICADOR","TRÁMITE","CANAL ATENCIÓN","PUNTUACIÓN",null,null,null,null,"No se completa totalmente en línea.",null,null,10.0]
["MINTUR-001-07-06","Actualización de Datos del Registro de Turismo para Centros Turísticos Comunitarios Persona Jurídica","No se completa totalmente en línea.",{"$f":"IF(ISBLANK(C5),\"\",IF(C5=\"Totalmente en línea\",0,IF(C5=\"Inicia en línea\",6,10)))","v":10}]
["MINTUR-001-06-04","Actualización de Datos del Registro de Turismo para Hipódromos y Parques de Atracciones Estables","No se completa totalmente en línea.",10]
["MINTUR-001-05-28","Actualización de Datos del Registro de Turismo para Transporte Turístico Aéreo","No se completa totalmente en línea.",10]
["MINTUR-001-05-18","Actualización de Datos del Registro de Turismo para Transporte Turístico Marítimo Continente","No se completa totalmente en línea.",10]
["MINTUR-001-05-13","Actualización de Datos del Registro de Turismo para Transporte Turístico Marítimo de Galápagos Persona Natural o Jurídica","No se completa totalmente en línea.",10]
["MINTUR-001-08-58","Actualización de información asociada a la Credencial de Registro de Turismo de Continente y Galápagos","No se completa totalmente en línea.",10]
["MINTUR-004-02-09","Asesoría para la obtención de dictámenes de viabilidad técnica y evaluación de proyectos de desarrollo de destinos turísticos.","No se completa totalmente en línea.",10]
["MINTUR-006-03-02","Coordinación para la Participación de eventos, ferias y campañas de promoción turística del destino Ecuador","No se completa totalmente en línea.",10]
["MINTUR-001-04-08","Emisión de Certificado de Inhabilitación del Registro de Turismo para Alimentos y Bebidas Persona Jurídica","Totalmente en Línea",0]
["MINTUR-001-07-04","Emisión de Certificado de Inhabilitación del Registro de Turismo para Centros Turísticos Comunitarios Persona Jurídica","No se completa totalmente en línea.",10]
["MINTUR-001-06-02","Emisión de Certificado de Inhabilitación del Registro de Turismo para Hipódromos y Parques de Atracciones Estables Persona Jurídica","No se completa totalmente en línea.",10]
{"$rows_left_out":113}
{"sheet":"RESUMEN","index":8,"n_rows":126,"n_cols":25,"rows_kept":126,"cut":false,"hidden":false,"merged":[[1,5,2,5],[1,6,2,6],[1,7,1,8],[1,9,1,10],[1,11,1,12],[1,13,2,13],[0,2,0,6],[0,7,0,12],[1,0,2,0],[1,1,2,1],[1,2,2,2],[1,3,2,3],[1,4,2,4]]}
[null,null,"BÁSICOS",null,null,null,null,"ADICIONALES"]
["ID trámite","Nombre del trámite","Demanda","Quejas","Costo para administración","Tiempo de respuesta","Canal de atención","Necesidades ciudadanas",null,"Susceptibilidad a corrupción",null,"Volumen de devoluciones",null,"PUNTAJE TOTAL"]
[null,null,null,null,null,null,null,"Criterio","Puntuación","Criterio","Puntuación","Criterio","Puntuación",null,null,null,null,null,null,null,"demanda",0.0,3.0,6.0,10.0]
["MINTUR-001-07-06","Actualización de Datos del Registro de Turismo para Centros Turísticos Comunitarios Persona Jurídica",{"$f":"VLOOKUP(A4,'DEMANDA ANUAL'!$A$5:$D$127,4,0)","v":0},{"$f":"VLOOKUP(A4,'VOLUMEN DE QUEJAS'!$A$5:$F$127,6,0)","v":0},{"$f":"VLOOKUP(A4,'RESUMEN DE COSTOS AP'!$A$5:$D$127,4,0)","v":10},{"$f":"VLOOKUP(A4,'TIEMPO DE RESPUESTA'!$A$5:$D$127,4,0)","v":0},{"$f":"VLOOKUP(A4,'CANAL ATENCIÓN'!$A$5:$D$127,4,0)","v":10},"SI",{"$f":"IF(H4=\"SI\",5,0)","v":5},"NO",{"$f":"IF(J4=\"SI\",10,0)","v":0},"NO",{"$f":"IF(L4=\"SI\",5,0)","v":0},{"$f":"SUM(C4:G4,I4,K4,M4)","v":25},null,null,null,null,null,null,"quejas",0.0,4.0,10.0]
["MINTUR-001-06-04","Actualización de Datos del Registro de Turismo para Hipódromos y Parques de Atracciones Estables",{"$f":"VLOOKUP(A5,'DEMANDA ANUAL'!$A$5:$D$127,4,0)","v":0},{"$f":"VLOOKUP(A5,'VOLUMEN DE QUEJAS'!$A$5:$F$127,6,0)","v":0},{"$f":"VLOOKUP(A5,'RESUMEN DE COSTOS AP'!$A$5:$D$127,4,0)","v":10},{"$f":"VLOOKUP(A5,'TIEMPO DE RESPUESTA'!$A$5:$D$127,4,0)","v":0},{"$f":"VLOOKUP(A5,'CANAL ATENCIÓN'!$A$5:$D$127,4,0)","v":10},"SI",5,"NO",0,"NO",0,25,null,null,null,null,null,null,"cpa",5.0,10.0,20.0]
["MINTUR-001-05-28","Actualización de Datos del Registro de Turismo para Transporte Turístico Aéreo",{"$f":"VLOOKUP(A6,'DEMANDA ANUAL'!$A$5:$D$127,4,0)","v":0},{"$f":"VLOOKUP(A6,'VOLUMEN DE QUEJAS'!$A$5:$F$127,6,0)","v":0},{"$f":"VLOOKUP(A6,'RESUMEN DE COSTOS AP'!$A$5:$D$127,4,0)","v":10},{"$f":"VLOOKUP(A6,'TIEMPO DE RESPUESTA'!$A$5:$D$127,4,0)","v":0},{"$f":"VLOOKUP(A6,'CANAL ATENCIÓN'!$A$5:$D$127,4,0)","v":10},"SI",5,"NO",0,"NO",0,25,null,null,null,null,null,null,"tr",0.0,30.0]
["MINTUR-001-05-18","Actualización de Datos del Registro de Turismo para Transporte Turístico Marítimo Continente",{"$f":"VLOOKUP(A7,'DEMANDA ANUAL'!$A$5:$D$127,4,0)","v":0},{"$f":"VLOOKUP(A7,'VOLUMEN DE QUEJAS'!$A$5:$F$127,6,0)","v":0},{"$f":"VLOOKUP(A7,'RESUMEN DE COSTOS AP'!$A$5:$D$127,4,0)","v":10},{"$f":"VLOOKUP(A7,'TIEMPO DE RESPUESTA'!$A$5:$D$127,4,0)","v":0},{"$f":"VLOOKUP(A7,'CANAL ATENCIÓN'!$A$5:$D$127,4,0)","v":10},"SI",5,"NO",0,"NO",0,25,null,null,null,null,null,null,"ca",0.0,10.0]
["MINTUR-001-05-13","Actualización de Datos del Registro de Turismo para Transporte Turístico Marítimo de Galápagos Persona Natural o Jurídica",{"$f":"VLOOKUP(A8,'DEMANDA ANUAL'!$A$5:$D$127,4,0)","v":0},{"$f":"VLOOKUP(A8,'VOLUMEN DE QUEJAS'!$A$5:$F$127,6,0)","v":0},{"$f":"VLOOKUP(A8,'RESUMEN DE COSTOS AP'!$A$5:$D$127,4,0)","v":10},{"$f":"VLOOKUP(A8,'TIEMPO DE RESPUESTA'!$A$5:$D$127,4,0)","v":0},{"$f":"VLOOKUP(A8,'CANAL ATENCIÓN'!$A$5:$D$127,4,0)","v":10},"SI",5,"NO",0,"NO",0,25,null,null,null,null,null,null,null,"SI","NO"]
["MINTUR-001-08-58","Actualización de información asociada a la Credencial de Registro de Turismo de Continente y Galápagos",{"$f":"VLOOKUP(A9,'DEMANDA ANUAL'!$A$5:$D$127,4,0)","v":0},{"$f":"VLOOKUP(A9,'VOLUMEN DE QUEJAS'!$A$5:$F$127,6,0)","v":0},{"$f":"VLOOKUP(A9,'RESUMEN DE COSTOS AP'!$A$5:$D$127,4,0)","v":5},{"$f":"VLOOKUP(A9,'TIEMPO DE RESPUESTA'!$A$5:$D$127,4,0)","v":0},{"$f":"VLOOKUP(A9,'CANAL ATENCIÓN'!$A$5:$D$127,4,0)","v":10},"SI",5,"NO",0,"NO",0,20]
["MINTUR-004-02-09","Asesoría para la obtención de dictámenes de viabilidad técnica y evaluación de proyectos de desarrollo de destinos turísticos.",{"$f":"VLOOKUP(A10,'DEMANDA ANUAL'!$A$5:$D$127,4,0)","v":0},{"$f":"VLOOKUP(A10,'VOLUMEN DE QUEJAS'!$A$5:$F$127,6,0)","v":0},{"$f":"VLOOKUP(A10,'RESUMEN DE COSTOS AP'!$A$5:$D$127,4,0)","v":5},{"$f":"VLOOKUP(A10,'TIEMPO DE RESPUESTA'!$A$5:$D$127,4,0)","v":0},{"$f":"VLOOKUP(A10,'CANAL ATENCIÓN'!$A$5:$D$127,4,0)","v":10},"SI",5,"NO",0,"NO",0,20]
["MINTUR-006-03-02","Coordinación para la Participación de eventos, ferias y campañas de promoción turística del destino Ecuador",{"$f":"VLOOKUP(A11,'DEMANDA ANUAL'!$A$5:$D$127,4,0)","v":0},{"$f":"VLOOKUP(A11,'VOLUMEN DE QUEJAS'!$A$5:$F$127,6,0)","v":0},{"$f":"VLOOKUP(A11,'RESUMEN DE COSTOS AP'!$A$5:$D$127,4,0)","v":20},{"$f":"VLOOKUP(A11,'TIEMPO DE RESPUESTA'!$A$5:$D$127,4,0)","v":0},{"$f":"VLOOKUP(A11,'CANAL ATENCIÓN'!$A$5:$D$127,4,0)","v":10},"SI",5,"NO",0,"NO",0,35]
["MINTUR-001-04-08","Emisión de Certificado de Inhabilitación del Registro de Turismo para Alimentos y Bebidas Persona Jurídica",{"$f":"VLOOKUP(A12,'DEMANDA ANUAL'!$A$5:$D$127,4,0)","v":0},{"$f":"VLOOKUP(A12,'VOLUMEN DE QUEJAS'!$A$5:$F$127,6,0)","v":0},{"$f":"VLOOKUP(A12,'RESUMEN DE COSTOS AP'!$A$5:$D$127,4,0)","v":10},{"$f":"VLOOKUP(A12,'TIEMPO DE RESPUESTA'!$A$5:$D$127,4,0)","v":0},{"$f":"VLOOKUP(A12,'CANAL ATENCIÓN'!$A$5:$D$127,4,0)","v":0},"SI",5,"NO",0,"NO",0,15]
["MINTUR-001-07-04","Emisión de Certificado de Inhabilitación del Registro de Turismo para Centros Turísticos Comunitarios Persona Jurídica",{"$f":"VLOOKUP(A13,'DEMANDA ANUAL'!$A$5:$D$127,4,0)","v":0},{"$f":"VLOOKUP(A13,'VOLUMEN DE QUEJAS'!$A$5:$F$127,6,0)","v":0},{"$f":"VLOOKUP(A13,'RESUMEN DE COSTOS AP'!$A$5:$D$127,4,0)","v":10},{"$f":"VLOOKUP(A13,'TIEMPO DE RESPUESTA'!$A$5:$D$127,4,0)","v":0},{"$f":"VLOOKUP(A13,'CANAL ATENCIÓN'!$A$5:$D$127,4,0)","v":10},"SI",5,"NO",0,"NO",0,25]
["MINTUR-001-06-02","Emisión de Certificado de Inhabilitación del Registro de Turismo para Hipódromos y Parques de Atracciones Estables Persona Jurídica",{"$f":"VLOOKUP(A14,'DEMANDA ANUAL'!$A$5:$D$127,4,0)","v":0},{"$f":"VLOOKUP(A14,'VOLUMEN DE QUEJAS'!$A$5:$F$127,6,0)","v":0},{"$f":"VLOOKUP(A14,'RESUMEN DE COSTOS AP'!$A$5:$D$127,4,0)","v":10},{"$f":"VLOOKUP(A14,'TIEMPO DE RESPUESTA'!$A$5:$D$127,4,0)","v":0},{"$f":"VLOOKUP(A14,'CANAL ATENCIÓN'!$A$5:$D$127,4,0)","v":10},"SI",5,"NO",0,"NO",0,25]
["MINTUR-001-03-03","Emisión de Certificado de Inhabilitación del Registro de Turismo para Operación e Intermediación Persona Jurídica",{"$f":"VLOOKUP(A15,'DEMANDA ANUAL'!$A$5:$D$127,4,0)","v":0},{"$f":"VLOOKUP(A15,'VOLUMEN DE QUEJAS'!$A$5:$F$127,6,0)","v":0},{"$f":"VLOOKUP(A15,'RESUMEN DE COSTOS AP'!$A$5:$D$127,4,0)","v":10},{"$f":"VLOOKUP(A15,'TIEMPO DE RESPUESTA'!$A$5:$D$127,4,0)","v":0},{"$f":"VLOOKUP(A15,'CANAL ATENCIÓN'!$A$5:$D$127,4,0)","v":0},"SI",5,"NO",0,"NO",0,15]
{"$rows_left_out":111}