{"text_format":"1","workbook":"xlsx","n_sheets":9,"sheets":["Instructivo","DEMANDA ANUAL","VOLUMEN DE QUEJAS","COSTO ADMINISTRACIÓN PÚBLICA","RESUMEN DE COSTOS AP","AUXILIAR COSTO ADMINISTRACIÓN","TIEMPO DE RESPUESTA","CANAL ATENCIÓN","RESUMEN"],"not_rendered":{"charts":0,"images":7,"macros":1,"external_links":0,"defined_names":5,"comments":5,"pivot_tables":0},"unopened":[],"bounds":{"document_bytes":16777216,"sheet_cells":100000,"rows_first":2000,"rows_last":500,"rows_between":2000,"halvings":0,"cell_chars":16384,"cell_head_chars":4096},"cells_cut":0,"cells_raw":0,"read":"whole","date_system":"1900"}

{"sheet":"Instructivo","index":0,"n_rows":70,"n_cols":1,"rows_kept":70,"cut":false,"hidden":false,"merged":[]}
["CRITERIO DE PRIORIZACIÓN DE TRÁMITES ADMINISTRATIVOS"]
["Instructivo"]
["Consideraciones generales"]
[]
["En las hojas “COSTO DE ADMINISTRACIÓN PÚBLICA”y “RESUMEN”  para añadir más trámites y que apliquen las fórmulas, se deberá seleccionar la primera fila y copiarla una por cada trámite de la entidad"]
[]
["Todas las hojas tienen columnas de color celeste, en las cuales NO deben ingresar valores ya que contienen fórmulas."]
["Para la carga en GOB.EC. La institución debe recordar que el peso máximo del archivo es de 2 MB."]
["Esquema de puntuación"]
["Para priorizar un trámite, se realizará un análisis de criterios básicos y adicionales basado en información que disponen las instituciones sujetas a esta norma técnica. Cada criterio será puntuado según los lineamientos presentes en esta norma."]
["a) Demanda Anual"]
["Considerará el volumen o frecuencia de las solicitudes que ingresan al año a cada institución para la gestión de un trámite en particular."]
["La identificación del volumen anual de los trámites se realizará a través de sus registros de transacciones y/o el número de visitas de consulta de información realizadas a través de páginas web institucionales."]
["Para realizar el registro realice lo siguiente:"]
["1.- Seleccione la hoja DEMANDA ANUAL"]
{"$rows_left_out":56}
{"sheet":"DEMANDA ANUAL","index":1,"n_rows":45,"n_cols":4,"rows_kept":45,"cut":false,"hidden":false,"merged":[[0,0,0,3],[1,0,1,3]]}
["PRIORIZACIÓN DE TRÁMITES ADMINISTRATIVOS"]
["DEMANDA ANUAL"]
[]
["IDENTIFICADOR","TRÁMITE","DEMANDA ANUAL","PUNTAJE"]
["MSP-010-01-02","Concesión de personería jurídica a corporaciones de segundo y tercer grado en servicios de salud.",0,0]
["MSP-015-03-01","Emisión del certificado provisional de persona con discapacidad a ecuatorianos(as) residentes en el exterior",1,3]
["MSP-010-04-01","Disolución y liquidación de organizaciones de sociedad civil",2,3]
["MSP-030-01-01","Emisión del Documento de No objeción de la o las intervenciones de la Organización No Gubernamental extranjera, en servicios de la salud",3,3]
["MSP-036-01-01","Indexación de revistas científicas de salud en la base de datos de Literatura Latinoamericana y del Caribe en Ciencias de la Salud - Ecuador",3,3]
["MSP-037-01-01","Aprobación de Comités de Ética Asistenciales para la Salud",6,3]
["MSP-010-05-01","Reforma al estatuto de organizaciones en servicios de salud.",9,3]
["MSP-037-02-01","Aprobación de Comités de Ética de Investigación en Seres Humanos",12,3]
["MSP-036-01-03","Evaluación de revistas científicas de salud indexadas en la base de datos de Literatura Latinoamericana y del Caribe en Ciencias de la Salud.",12,3]
["MSP-034-01-01","Aprobación de investigaciones observacionales en salud",18,3]
["MSP-022-01-02","Autorización a las brigadas de atención en salud con participación de profesionales de la salud nacionales y extranjeros domiciliados en el país, con títulos no registrados en el Ecuador",19,3]
{"$rows_left_out":31}
{"sheet":"VOLUMEN DE QUEJAS","index":2,"n_rows":45,"n_cols":6,"rows_kept":45,"cut":false,"hidden":false,"merged":[[0,0,0,5],[1,0,1,5]]}
["PRIORIZACIÓN DE TRÁMITES ADMINISTRATIVOS"]
["VOLUMEN DE QUEJAS"]
[]
["IDENTIFICADOR","TRÁMITE","VOLUMEN DEMANDA","VOLUMEN DE QUEJAS","PORCENTAJE","PUNTUACIÓN"]
["MSP-010-01-02","Concesión de personería jurídica a corporaciones de segundo y tercer grado en servicios de salud.",0,0,0,0]
["MSP-015-03-01","Emisión del certificado provisional de persona con discapacidad a ecuatorianos(as) residentes en el exterior",1,0,0,0]
["MSP-010-04-01","Disolución y liquidación de organizaciones de sociedad civil",2,0,0,0]
["MSP-030-01-01","Emisión del Documento de No objeción de la o las intervenciones de la Organización No Gubernamental extranjera, en servicios de la salud",3,0,0,0]
["MSP-036-01-01","Indexación de revistas científicas de salud en la base de datos de Literatura Latinoamericana y del Caribe en Ciencias de la Salud - Ecuador",3,0,0,0]
["MSP-037-01-01","Aprobación de Comités de Ética Asistenciales para la Salud",6,0,0,0]
["MSP-010-05-01","Reforma al estatuto de organizaciones en servicios de salud.",9,0,0,0]
["MSP-037-02-01","Aprobación de Comités de Ética de Investigación en Seres Humanos",12,0,0,0]
["MSP-036-01-03","Evaluación de revistas científicas de salud indexadas en la base de datos de Literatura Latinoamericana y del Caribe en Ciencias de la Salud.",12,0,0,0]
["MSP-034-01-01","Aprobación de investigaciones observacionales en salud",18,0,0,0]
["MSP-022-01-02","Autorización a las brigadas de atención en salud con participación de profesionales de la salud nacionales y extranjeros domiciliados en el país, con títulos no registrados en el Ecuador",19,0,0,0]
{"$rows_left_out":31}
{"sheet":"COSTO ADMINISTRACIÓN PÚBLICA","index":3,"n_rows":46,"n_cols":9,"rows_kept":46,"cut":false,"hidden":false,"merged":[[0,0,0,5],[1,0,1,5],[3,0,4,0],[3,1,4,1],[3,2,3,4],[3,5,4,5]]}
["PRIORIZACIÓN DE TRÁMITES ADMINISTRATIVOS"]
["COSTOS PARA LA ADMINISTRACIÓN PÚBLICA"]
[]
["IDENTIFICADOR","TRÁMITE","INSUMOS PARA COSTO",null,null,"COSTO PARA LA ADM. PÚBLICA",null,"SBU",400]
[null,null,"TIEMPO (HORAS)","COSTO PERSONAL","COSTO RECURSOS"]
["MSP-010-01-02","Concesión de personería jurídica a corporaciones de segundo y tercer grado en servicios de salud.",130,{"$f":"C6*$I$4/160","v":325},2,{"$f":"D6+E6","v":327}]
["MSP-015-03-01","Emisión del certificado provisional de persona con discapacidad a ecuatorianos(as) residentes en el exterior",3.17,26.64,1.5,{"$f":"D7+E7","v":28.14}]
["MSP-010-04-01","Disolución y liquidación de organizaciones de sociedad civil",80,{"$f":"C8*$I$4/160","v":200},19.11,{"$f":"D8+E8","v":219.11}]
["MSP-030-01-01","Emisión del Documento de No objeción de la o las intervenciones de la Organización No Gubernamental extranjera, en servicios de la salud",5.67,56.9,0,56.9]
["MSP-036-01-01","Indexación de revistas científicas de salud en la base de datos de Literatura Latinoamericana y del Caribe en Ciencias de la Salud - Ecuador",129.16999999999999,1226.77,0,1226.77]
["MSP-037-01-01","Aprobación de Comités de Ética Asistenciales para la Salud",122.5,1025.93,0,{"$f":"D11+E11","v":1025.93}]
["MSP-010-05-01","Reforma al estatuto de organizaciones en servicios de salud.",157,{"$f":"C12*$I$4/160","v":392.5},6.37,398.87]
["MSP-037-02-01","Aprobación de Comités de Ética de Investigación en Seres Humanos",164.5,1429.2,0,1429.2]
["MSP-036-01-03","Evaluación de revistas científicas de salud indexadas en la base de datos de Literatura Latinoamericana y del Caribe en Ciencias de la Salud.",125.17,1188.67,0,1188.67]
["MSP-034-01-01","Aprobación de investigaciones observacionales en salud",126,1122.94,0,1122.94]
{"$rows_left_out":32}
{"sheet":"RESUMEN DE COSTOS AP","index":4,"n_rows":45,"n_cols":4,"rows_kept":45,"cut":false,"hidden":false,"merged":[[0,0,0,5],[1,0,1,5]]}
["PRIORIZACIÓN DE TRÁMITES ADMINISTRATIVOS"]
["COSTOS PARA LA ADMINISTRACIÓN PÚBLICA"]
[]
["IDENTIFICADOR","TRÁMITE","COSTO PARA LA ADM. PÚBLICA","PUNTUACIÓN"]
["MSP-039-01-01","Certificación de Documentos Administrativos generados por el Sistema Nacional de Salud",1.08,5]
["MSP-028-01-01","Cita médica a través de la línea telefónica gratuita 171",1.32,5]
["MSP-024-02-02","Emisión del Certificado Único de Salud para jóvenes y adultos",1.55,5]
["MSP-024-01-02","Emisión del Certificado Único de Salud para niños y adolescentes",1.55,5]
["MSP-017-01-01","Atención a consulta de estado de trámites ingresados al Ministerio de Salud Pública",1.93,5]
["MSP-017-01-02","Atención a información sobre servicios del Ministerio de Salud Pública y sus entidades Adscritas",1.93,5]
["MSP-014-01-01","Validación del año de salud rural realizado en el exterior",2.5499999999999998,5]
["MSP-028-02-01","Cita médica acercándose directamente al establecimiento de salud",2.68,5]
["MSP-012-01-08","Postulación para asignación de plazas para el cumplimiento del año de salud rural de servicio social a profesionales de la salud de tercer nivel",2.91,5]
["MSP-016-04-02","Emisión de la autorización sanitaria para el transporte fuera del territorio nacional de cadáveres, mortinatos, piezas anatómicas, osamentas y cenizas humanas",8.5,5]
["MSP-016-03-01","Emisión de la autorización sanitaria para la exhumación de cadáveres, mortinatos, piezas anatómicas u osamentas humanas sin fines legales",8.51,5]
{"$rows_left_out":31}
{"sheet":"AUXILIAR COSTO ADMINISTRACIÓN","index":5,"n_rows":20,"n_cols":3,"rows_kept":20,"cut":false,"hidden":true,"merged":[[1,1,1,2]]}
[]
["TRÁMITE:"]
["NO.","ACTIVIDAD","TIEMPO (HORAS)"]
[1,"Recibir el documento"]
[2]
[3]
[4]
[5]
[6]
[7]
[8]
[9]
[10]
[11]
[12]
{"$rows_left_out":6}
{"sheet":"TIEMPO DE RESPUESTA","index":6,"n_rows":45,"n_cols":4,"rows_kept":45,"cut":false,"hidden":false,"merged":[[0,0,0,3],[1,0,1,3]]}
["PRIORIZACIÓN DE TRÁMITES ADMINISTRATIVOS"]
["TIEMPO DE RESPUESTA"]
[]
["IDENTIFICADOR","TRÁMITE","TIEMPO RESPUESTA (horas laborables)","PUNTUACIÓN"]
["MSP-010-01-02","Concesión de personería jurídica a corporaciones de segundo y tercer grado en servicios de salud.",130,30]
["MSP-015-03-01","Emisión del certificado provisional de persona con discapacidad a ecuatorianos(as) residentes en el exterior",120,30]
["MSP-010-04-01","Disolución y liquidación de organizaciones de sociedad civil",80,30]
["MSP-030-01-01","Emisión del Documento de No objeción de la o las intervenciones de la Organización No Gubernamental extranjera, en servicios de la salud",160,30]
["MSP-036-01-01","Indexación de revistas científicas de salud en la base de datos de Literatura Latinoamericana y del Caribe en Ciencias de la Salud - Ecuador",288,30]
["MSP-037-01-01","Aprobación de Comités de Ética Asistenciales para la Salud",352,30]
["MSP-010-05-01","Reforma al estatuto de organizaciones en servicios de salud.",157,30]
["MSP-037-02-01","Aprobación de Comités de Ética de Investigación en Seres Humanos",376,30]
["MSP-036-01-03","Evaluación de revistas científicas de salud indexadas en la base de datos de Literatura Latinoamericana y del Caribe en Ciencias de la Salud.",240,30]
["MSP-034-01-01","Aprobación de investigaciones observacionales en salud",296,30]
["MSP-022-01-02","Autorización a las brigadas de atención en salud con participación de profesionales de la salud nacionales y extranjeros domiciliados en el país, con títulos no registrados en el Ecuador",200,30]
{"$rows_left_out":31}
{"sheet":"CANAL ATENCIÓN","index":7,"n_rows":45,"n_cols":12,"rows_kept":45,"cut":false,"hidden":false,"merged":[[0,0,0,3],[1,0,1,3]]}
["PRIORIZACIÓN DE TRÁMITES ADMINISTRATIVOS"]
["CANAL DE ATENCIÓN"]
[null,null,null,null,null,null,null,null,"Totalmente en Línea",null,null,0]
["IDENTIFICADOR","TRÁMITE","CANAL ATENCIÓN","PUNTUACIÓN",null,null,null,null,"No se completa totalmente en línea.",null,null,10]
["MSP-010-01-02","Concesión de personería jurídica a corporaciones de segundo y tercer grado en servicios de salud.","No se completa totalmente en línea.",{"$f":"IF(ISBLANK(C5),\"\",IF(C5=\"Totalmente en línea\",0,IF(C5=\"Inicia en línea\",6,10)))","v":10}]
["MSP-015-03-01","Emisión del certificado provisional de persona con discapacidad a ecuatorianos(as) residentes en el exterior","No se completa totalmente en línea.",{"$f":"IF(ISBLANK(C6),\"\",IF(C6=\"Totalmente en línea\",0,IF(C6=\"Inicia en línea\",6,10)))","v":10}]
["MSP-010-04-01","Disolución y liquidación de organizaciones de sociedad civil","No se completa totalmente en línea.",10]
["MSP-030-01-01","Emisión del Documento de No objeción de la o las intervenciones de la Organización No Gubernamental extranjera, en servicios de la salud","Totalmente en Línea",0]
["MSP-036-01-01","Indexación de revistas científicas de salud en la base de datos de Literatura Latinoamericana y del Caribe en Ciencias de la Salud - Ecuador","Totalmente en Línea",0]
["MSP-037-01-01","Aprobación de Comités de Ética Asistenciales para la Salud","Totalmente en Línea",0]
["MSP-010-05-01","Reforma al estatuto de organizaciones en servicios de salud.","No se completa totalmente en línea.",10]
["MSP-037-02-01","Aprobación de Comités de Ética de Investigación en Seres Humanos","Totalmente en Línea",0]
["MSP-036-01-03","Evaluación de revistas científicas de salud indexadas en la base de datos de Literatura Latinoamericana y del Caribe en Ciencias de la Salud.","Totalmente en Línea",0]
["MSP-034-01-01","Aprobación de investigaciones observacionales en salud","Totalmente en Línea",0]
["MSP-022-01-02","Autorización a las brigadas de atención en salud con participación de profesionales de la salud nacionales y extranjeros domiciliados en el país, con títulos no registrados en el Ecuador","No se completa totalmente en línea.",10]
{"$rows_left_out":31}
{"sheet":"RESUMEN","index":8,"n_rows":44,"n_cols":25,"rows_kept":44,"cut":false,"hidden":false,"merged":[[1,9,1,10],[1,11,1,12],[1,13,2,13],[0,2,0,6],[0,7,0,12],[1,5,2,5],[1,6,2,6],[1,7,1,8],[1,0,2,0],[1,1,2,1],[1,2,2,2],[1,3,2,3],[1,4,2,4]]}
[null,null,"BÁSICOS",null,null,null,null,"ADICIONALES"]
["ID trámite","Nombre del trámite","Demanda","Quejas","Costo para administración","Tiempo de respuesta","Canal de atención","Necesidades ciudadanas",null,"Susceptibilidad a corrupción",null,"Volumen de devoluciones",null,"PUNTAJE TOTAL"]
[null,null,null,null,null,null,null,"Criterio","Puntuación","Criterio","Puntuación","Criterio","Puntuación",null,null,null,null,null,null,null,"demanda",0,3,6,10]
["MSP-010-01-02","Concesión de personería jurídica a corporaciones de segundo y tercer grado en servicios de salud.",{"$f":"VLOOKUP(A4,'DEMANDA ANUAL'!A5:$D$45,4,0)","v":0},{"$f":"VLOOKUP(A4,'VOLUMEN DE QUEJAS'!$A$5:$F$45,6,0)","v":0},{"$f":"VLOOKUP(A4,'RESUMEN DE COSTOS AP'!$A$5:$D$45,4,0)","v":20},{"$f":"VLOOKUP(A4,'TIEMPO DE RESPUESTA'!$A$5:$D$45,4,0)","v":30},{"$f":"VLOOKUP(A4,'CANAL ATENCIÓN'!$A$5:$D$45,4,0)","v":10},"NO",{"$f":"IF(H4=\"SI\",5,0)","v":0},"NO",{"$f":"IF(J4=\"SI\",10,0)","v":0},"NO",{"$f":"IF(L4=\"SI\",5,0)","v":0},{"$f":"SUM(C4:G4,I4,K4,M4)","v":60},null,null,null,null,null,null,"quejas",0,4,10]
["MSP-015-03-01","Emisión del certificado provisional de persona con discapacidad a ecuatorianos(as) residentes en el exterior",{"$f":"VLOOKUP(A5,'DEMANDA ANUAL'!A6:$D$45,4,0)","v":3},{"$f":"VLOOKUP(A5,'VOLUMEN DE QUEJAS'!$A$5:$F$45,6,0)","v":0},{"$f":"VLOOKUP(A5,'RESUMEN DE COSTOS AP'!$A$5:$D$45,4,0)","v":10},{"$f":"VLOOKUP(A5,'TIEMPO DE RESPUESTA'!$A$5:$D$45,4,0)","v":30},{"$f":"VLOOKUP(A5,'CANAL ATENCIÓN'!$A$5:$D$45,4,0)","v":10},"NO",{"$f":"IF(H5=\"SI\",5,0)","v":0},"NO",{"$f":"IF(J5=\"SI\",10,0)","v":0},"NO",{"$f":"IF(L5=\"SI\",5,0)","v":0},{"$f":"SUM(C5:G5,I5,K5,M5)","v":53},null,null,null,null,null,null,"cpa",5,10,20]
["MSP-010-04-01","Disolución y liquidación de organizaciones de sociedad civil",{"$f":"VLOOKUP(A6,'DEMANDA ANUAL'!A7:$D$45,4,0)","v":3},{"$f":"VLOOKUP(A6,'VOLUMEN DE QUEJAS'!$A$5:$F$45,6,0)","v":0},{"$f":"VLOOKUP(A6,'RESUMEN DE COSTOS AP'!$A$5:$D$45,4,0)","v":20},{"$f":"VLOOKUP(A6,'TIEMPO DE RESPUESTA'!$A$5:$D$45,4,0)","v":30},{"$f":"VLOOKUP(A6,'CANAL ATENCIÓN'!$A$5:$D$45,4,0)","v":10},"NO",{"$f":"IF(H6=\"SI\",5,0)","v":0},"NO",0,"NO",0,{"$f":"SUM(C6:G6,I6,K6,M6)","v":63},null,null,null,null,null,null,"tr",0,30]
["MSP-030-01-01","Emisión del Documento de No objeción de la o las intervenciones de la Organización No Gubernamental extranjera, en servicios de la salud",{"$f":"VLOOKUP(A7,'DEMANDA ANUAL'!A8:$D$45,4,0)","v":3},{"$f":"VLOOKUP(A7,'VOLUMEN DE QUEJAS'!$A$5:$F$45,6,0)","v":0},{"$f":"VLOOKUP(A7,'RESUMEN DE COSTOS AP'!$A$5:$D$45,4,0)","v":10},{"$f":"VLOOKUP(A7,'TIEMPO DE RESPUESTA'!$A$5:$D$45,4,0)","v":30},{"$f":"VLOOKUP(A7,'CANAL ATENCIÓN'!$A$5:$D$45,4,0)","v":0},"NO",{"$f":"IF(H7=\"SI\",5,0)","v":0},"NO",0,"NO",0,43,null,null,null,null,null,null,"ca",0,10]
["MSP-036-01-01","Indexación de revistas científicas de salud en la base de datos de Literatura Latinoamericana y del Caribe en Ciencias de la Salud - Ecuador",{"$f":"VLOOKUP(A8,'DEMANDA ANUAL'!A9:$D$45,4,0)","v":3},{"$f":"VLOOKUP(A8,'VOLUMEN DE QUEJAS'!$A$5:$F$45,6,0)","v":0},{"$f":"VLOOKUP(A8,'RESUMEN DE COSTOS AP'!$A$5:$D$45,4,0)","v":20},{"$f":"VLOOKUP(A8,'TIEMPO DE RESPUESTA'!$A$5:$D$45,4,0)","v":30},{"$f":"VLOOKUP(A8,'CANAL ATENCIÓN'!$A$5:$D$45,4,0)","v":0},"NO",0,"NO",0,"SI",5,58,null,null,null,null,null,null,null,"SI","NO"]
["MSP-037-01-01","Aprobación de Comités de Ética Asistenciales para la Salud",{"$f":"VLOOKUP(A9,'DEMANDA ANUAL'!A10:$D$45,4,0)","v":3},{"$f":"VLOOKUP(A9,'VOLUMEN DE QUEJAS'!$A$5:$F$45,6,0)","v":0},{"$f":"VLOOKUP(A9,'RESUMEN DE COSTOS AP'!$A$5:$D$45,4,0)","v":20},{"$f":"VLOOKUP(A9,'TIEMPO DE RESPUESTA'!$A$5:$D$45,4,0)","v":30},{"$f":"VLOOKUP(A9,'CANAL ATENCIÓN'!$A$5:$D$45,4,0)","v":0},"NO",0,"NO",0,"SI",5,58]
["MSP-010-05-01","Reforma al estatuto de organizaciones en servicios de salud.",{"$f":"VLOOKUP(A10,'DEMANDA ANUAL'!A11:$D$45,4,0)","v":3},{"$f":"VLOOKUP(A10,'VOLUMEN DE QUEJAS'!$A$5:$F$45,6,0)","v":0},{"$f":"VLOOKUP(A10,'RESUMEN DE COSTOS AP'!$A$5:$D$45,4,0)","v":20},{"$f":"VLOOKUP(A10,'TIEMPO DE RESPUESTA'!$A$5:$D$45,4,0)","v":30},{"$f":"VLOOKUP(A10,'CANAL ATENCIÓN'!$A$5:$D$45,4,0)","v":10},"NO",0,"NO",0,"NO",0,63]
["MSP-037-02-01","Aprobación de Comités de Ética de Investigación en Seres Humanos",{"$f":"VLOOKUP(A11,'DEMANDA ANUAL'!A12:$D$45,4,0)","v":3},{"$f":"VLOOKUP(A11,'VOLUMEN DE QUEJAS'!$A$5:$F$45,6,0)","v":0},{"$f":"VLOOKUP(A11,'RESUMEN DE COSTOS AP'!$A$5:$D$45,4,0)","v":20},{"$f":"VLOOKUP(A11,'TIEMPO DE RESPUESTA'!$A$5:$D$45,4,0)","v":30},{"$f":"VLOOKUP(A11,'CANAL ATENCIÓN'!$A$5:$D$45,4,0)","v":0},"NO",0,"NO",0,"SI",5,58]
["MSP-036-01-03","Evaluación de revistas científicas de salud indexadas en la base de datos de Literatura Latinoamericana y del Caribe en Ciencias de la Salud.",{"$f":"VLOOKUP(A12,'DEMANDA ANUAL'!A13:$D$45,4,0)","v":3},{"$f":"VLOOKUP(A12,'VOLUMEN DE QUEJAS'!$A$5:$F$45,6,0)","v":0},{"$f":"VLOOKUP(A12,'RESUMEN DE COSTOS AP'!$A$5:$D$45,4,0)","v":20},{"$f":"VLOOKUP(A12,'TIEMPO DE RESPUESTA'!$A$5:$D$45,4,0)","v":30},{"$f":"VLOOKUP(A12,'CANAL ATENCIÓN'!$A$5:$D$45,4,0)","v":0},"NO",0,"NO",0,"SI",5,58]
["MSP-034-01-01","Aprobación de investigaciones observacionales en salud",{"$f":"VLOOKUP(A13,'DEMANDA ANUAL'!A14:$D$45,4,0)","v":3},{"$f":"VLOOKUP(A13,'VOLUMEN DE QUEJAS'!$A$5:$F$45,6,0)","v":0},{"$f":"VLOOKUP(A13,'RESUMEN DE COSTOS AP'!$A$5:$D$45,4,0)","v":20},{"$f":"VLOOKUP(A13,'TIEMPO DE RESPUESTA'!$A$5:$D$45,4,0)","v":30},{"$f":"VLOOKUP(A13,'CANAL ATENCIÓN'!$A$5:$D$45,4,0)","v":0},"NO",0,"NO",0,"SI",5,58]
["MSP-022-01-02","Autorización a las brigadas de atención en salud con participación de profesionales de la salud nacionales y extranjeros domiciliados en el país, con títulos no registrados en el Ecuador",{"$f":"VLOOKUP(A14,'DEMANDA ANUAL'!A15:$D$45,4,0)","v":3},{"$f":"VLOOKUP(A14,'VOLUMEN DE QUEJAS'!$A$5:$F$45,6,0)","v":0},{"$f":"VLOOKUP(A14,'RESUMEN DE COSTOS AP'!$A$5:$D$45,4,0)","v":20},{"$f":"VLOOKUP(A14,'TIEMPO DE RESPUESTA'!$A$5:$D$45,4,0)","v":30},{"$f":"VLOOKUP(A14,'CANAL ATENCIÓN'!$A$5:$D$45,4,0)","v":10},"NO",0,"NO",0,"NO",0,63]
["MSP-010-01-01","Concesión de personalidad jurídica a fundaciones o corporaciones de primer grado en servicios de salud.",{"$f":"VLOOKUP(A15,'DEMANDA ANUAL'!A16:$D$45,4,0)","v":3},{"$f":"VLOOKUP(A15,'VOLUMEN DE QUEJAS'!$A$5:$F$45,6,0)","v":0},{"$f":"VLOOKUP(A15,'RESUMEN DE COSTOS AP'!$A$5:$D$45,4,0)","v":20},{"$f":"VLOOKUP(A15,'TIEMPO DE RESPUESTA'!$A$5:$D$45,4,0)","v":30},{"$f":"VLOOKUP(A15,'CANAL ATENCIÓN'!$A$5:$D$45,4,0)","v":10},"NO",0,"NO",0,"NO",0,63]
{"$rows_left_out":29}