{"text_format":"1","workbook":"xlsx","n_sheets":9,"sheets":["Instructivo","DEMANDA ANUAL","VOLUMEN DE QUEJAS","COSTO ADMINISTRACIÓN PÚBLICA","RESUMEN DE COSTOS AP","AUXILIAR COSTO ADMINISTRACIÓN","TIEMPO DE RESPUESTA","CANAL ATENCIÓN","RESUMEN"],"not_rendered":{"charts":0,"images":7,"macros":1,"external_links":0,"defined_names":1,"comments":5,"pivot_tables":0},"unopened":[],"bounds":{"document_bytes":16777216,"sheet_cells":100000,"rows_first":2000,"rows_last":500,"rows_between":2000,"halvings":0,"cell_chars":16384,"cell_head_chars":4096},"cells_cut":0,"cells_raw":0,"read":"whole","date_system":"1900"}

{"sheet":"Instructivo","index":0,"n_rows":70,"n_cols":1,"rows_kept":70,"cut":false,"hidden":false,"merged":[]}
["CRITERIO DE PRIORIZACIÓN DE TRÁMITES ADMINISTRATIVOS"]
["Instructivo"]
["Consideraciones generales"]
[]
["En las hojas “COSTO DE ADMINISTRACIÓN PÚBLICA”y “RESUMEN”  para añadir más trámites y que apliquen las fórmulas, se deberá seleccionar la primera fila y copiarla una por cada trámite de la entidad"]
[]
["Todas las hojas tienen columnas de color celeste, en las cuales NO deben ingresar valores ya que contienen fórmulas."]
["Para la carga en GOB.EC. La institución debe recordar que el peso máximo del archivo es de 2 MB."]
["Esquema de puntuación"]
["Para priorizar un trámite, se realizará un análisis de criterios básicos y adicionales basado en información que disponen las instituciones sujetas a esta norma técnica. Cada criterio será puntuado según los lineamientos presentes en esta norma."]
["a) Demanda Anual"]
["Considerará el volumen o frecuencia de las solicitudes que ingresan al año a cada institución para la gestión de un trámite en particular."]
["La identificación del volumen anual de los trámites se realizará a través de sus registros de transacciones y/o el número de visitas de consulta de información realizadas a través de páginas web institucionales."]
["Para realizar el registro realice lo siguiente:"]
["1.- Seleccione la hoja DEMANDA ANUAL"]
["2.- Ingrese los trámites de la institución registrando el identificador y nombre en las columnas respectivas.  "]
["3.- Para cada trámite debe especificar en la columna DEMANDA ANUAL el volumen o frecuencia anual, de acuerdo a lo mencionado anteriormente."]
["4.- Una vez terminado el llenado solicitado presione el botón PUNTUACIÓN, se ordenara de menor a mayor. "]
["5.- Usted visualizará el ordenamiento de los trámites ingresados de acuerdo al número de  volumen o frecuencia anual."]
["6.- Así mismo, usted visualizará el puntaje obtenido en la columna PUNTUACIÓN de acuerdo al grupo obtenido por cada trámite de acuerdo al número de volumen o frecuencia anual cosiderando lo siguiente: ** Primer grupo (trámites con menor demanda no incluye los trámites con demanda 0 ) = 3\n** Segundo grupo (trámites con demanda intermedia) = 6\n** Tercer grupo (trámites con mayor demanda) = 10"]
{"$rows_left_out":51}
{"sheet":"DEMANDA ANUAL","index":1,"n_rows":152,"n_cols":4,"rows_kept":152,"cut":false,"hidden":false,"merged":[[0,0,0,3],[1,0,1,3]]}
["PRIORIZACIÓN DE TRÁMITES ADMINISTRATIVOS"]
["DEMANDA ANUAL"]
[]
["IDENTIFICADOR","TRÁMITE","DEMANDA ANUAL","PUNTAJE"]
["MH-042-02-01","Acumulación de Áreas de Régimen de Minería Artesanal Para la Modificación a Régimen de Pequeña Minería",0,0]
["MH-043-01-01","Acumulación de Áreas Mineras",0,0]
["MH-054-01-01","Ampliación de Evaluación Económica del Yacimiento de Concesiones de Mediana / Gran Minería",0,0]
["MH-025-02-02","Análisis de PCBs en aceite dieléctrico, empresa particular",0,0]
["MH-025-02-03","Análisis de PCBs en aceite dieléctrico, empresas eléctricas",0,0]
["MH-025-03-02","Análisis de residuos de glifosato en suelo o agua",0,0]
["MH-025-01-01","Análisis de residuos de hidrocarburos aromáticos policíclicos HAPs en agua o suelo",0,0]
["MH-025-03-01","Análisis de residuos de OCls y OPs por cromatografía de gases, en biotas, suelo o agua",0,0]
["MH-025-02-01","Análisis de residuos de PCBs en agua o suelo",0,0]
["MH-024-01-03","Análisis de tritio en muestras acuosas",0,0]
["MH-007-01-02","Aprobación de construcción de nuevas facilidades, ampliación, mejoramiento y o modificación de facilidades existentes. (actividades que no se encuentran dentro del presupuesto anual aprobado)",0,0]
["MERNNR-068-01-01","Aprobación de la caracterización de yacimientos por campo",0,0]
["MERNNR-067-01-02","Aprobación de la prolongación de Pruebas de Inyección de fluidos",0,0]
["MERNNR-067-01-03","Aprobación de la prolongación de Pruebas de Reinyección de fluidos",0,0]
["MERNNR-015-02-02","Aprobación de la reforma al programas de actividades y presupuestos de inversiones, costos y gastos anuales para empresas privadas",0,0]
["MERNNR-058-01-02","Aprobación de perforación de pozos de re-entry",0,0]
{"$rows_left_out":133}
{"sheet":"VOLUMEN DE QUEJAS","index":2,"n_rows":152,"n_cols":6,"rows_kept":152,"cut":false,"hidden":false,"merged":[[0,0,0,5],[1,0,1,5]]}
["PRIORIZACIÓN DE TRÁMITES ADMINISTRATIVOS"]
["VOLUMEN DE QUEJAS"]
[]
["IDENTIFICADOR","TRÁMITE","VOLUMEN DEMANDA","VOLUMEN DE QUEJAS","PORCENTAJE","PUNTUACIÓN"]
["MH-042-02-01","Acumulación de Áreas de Régimen de Minería Artesanal Para la Modificación a Régimen de Pequeña Minería",0,0,0,0]
["MH-043-01-01","Acumulación de Áreas Mineras",0,0,0,0]
["MH-054-01-01","Ampliación de Evaluación Económica del Yacimiento de Concesiones de Mediana / Gran Minería",0,0,0,0]
["MH-025-02-02","Análisis de PCBs en aceite dieléctrico, empresa particular",0,0,0,0]
["MH-025-02-03","Análisis de PCBs en aceite dieléctrico, empresas eléctricas",0,0,0,0]
["MH-025-03-02","Análisis de residuos de glifosato en suelo o agua",0,0,0,0]
["MH-025-01-01","Análisis de residuos de hidrocarburos aromáticos policíclicos HAPs en agua o suelo",0,0,0,0]
["MH-025-03-01","Análisis de residuos de OCls y OPs por cromatografía de gases, en biotas, suelo o agua",0,0,0,0]
["MH-025-02-01","Análisis de residuos de PCBs en agua o suelo",0,0,0,0]
["MH-024-01-03","Análisis de tritio en muestras acuosas",0,0,0,0]
["MH-007-01-02","Aprobación de construcción de nuevas facilidades, ampliación, mejoramiento y o modificación de facilidades existentes. (actividades que no se encuentran dentro del presupuesto anual aprobado)",0,0,0,0]
["MERNNR-068-01-01","Aprobación de la caracterización de yacimientos por campo",0,0,0,0]
["MERNNR-067-01-02","Aprobación de la prolongación de Pruebas de Inyección de fluidos",0,0,0,0]
["MERNNR-067-01-03","Aprobación de la prolongación de Pruebas de Reinyección de fluidos",0,0,0,0]
["MERNNR-015-02-02","Aprobación de la reforma al programas de actividades y presupuestos de inversiones, costos y gastos anuales para empresas privadas",0,0,0,0]
["MERNNR-058-01-02","Aprobación de perforación de pozos de re-entry",0,0,0,0]
{"$rows_left_out":133}
{"sheet":"COSTO ADMINISTRACIÓN PÚBLICA","index":3,"n_rows":153,"n_cols":9,"rows_kept":153,"cut":false,"hidden":false,"merged":[[0,0,0,5],[1,0,1,5],[3,0,4,0],[3,1,4,1],[3,2,3,4],[3,5,4,5]]}
["PRIORIZACIÓN DE TRÁMITES ADMINISTRATIVOS"]
["COSTOS PARA LA ADMINISTRACIÓN PÚBLICA"]
[]
["IDENTIFICADOR","TRÁMITE","INSUMOS PARA COSTO",null,null,"COSTO PARA LA ADM. PÚBLICA",null,"SBU",400]
[null,null,"TIEMPO (HORAS)","COSTO PERSONAL","COSTO RECURSOS"]
["MH-042-02-01","Acumulación de Áreas de Régimen de Minería Artesanal Para la Modificación a Régimen de Pequeña Minería",28.6,{"$f":"C6*$I$4/160","v":71.5},214.6,{"$f":"D6+E6","v":286.10000000000002}]
["MH-043-01-01","Acumulación de Áreas Mineras",28.6,{"$f":"C7*$I$4/160","v":71.5},214.6,{"$f":"D7+E7","v":286.10000000000002}]
["MH-054-01-01","Ampliación de Evaluación Económica del Yacimiento de Concesiones de Mediana / Gran Minería",32.35,80.875,415.39,496.26499999999999]
["MH-025-02-02","Análisis de PCBs en aceite dieléctrico, empresa particular",24.15,60.375,300.74,361.11500000000001]
["MH-025-02-03","Análisis de PCBs en aceite dieléctrico, empresas eléctricas",24.15,60.375,376.63,437.005]
["MH-025-03-02","Análisis de residuos de glifosato en suelo o agua",24.15,60.375,222.47,282.84500000000003]
["MH-025-01-01","Análisis de residuos de hidrocarburos aromáticos policíclicos HAPs en agua o suelo",32.35,80.875,415.39,496.26499999999999]
["MH-025-03-01","Análisis de residuos de OCls y OPs por cromatografía de gases, en biotas, suelo o agua",32.35,80.875,235.22,316.09500000000003]
["MH-025-02-01","Análisis de residuos de PCBs en agua o suelo",32.35,80.875,215.45,296.32499999999999]
["MH-024-01-03","Análisis de tritio en muestras acuosas",32.35,80.875,215.45,296.32499999999999]
["MH-007-01-02","Aprobación de construcción de nuevas facilidades, ampliación, mejoramiento y o modificación de facilidades existentes. (actividades que no se encuentran dentro del presupuesto anual aprobado)",32.35,80.875,215.45,296.32499999999999]
["MERNNR-068-01-01","Aprobación de la caracterización de yacimientos por campo",32.35,80.875,215.45,296.32499999999999]
["MERNNR-067-01-02","Aprobación de la prolongación de Pruebas de Inyección de fluidos",32.35,80.875,215.45,296.32499999999999]
["MERNNR-067-01-03","Aprobación de la prolongación de Pruebas de Reinyección de fluidos",32.35,80.875,215.45,296.32499999999999]
["MERNNR-015-02-02","Aprobación de la reforma al programas de actividades y presupuestos de inversiones, costos y gastos anuales para empresas privadas",32.35,80.875,235.22,316.09500000000003]
{"$rows_left_out":134}
{"sheet":"RESUMEN DE COSTOS AP","index":4,"n_rows":152,"n_cols":4,"rows_kept":152,"cut":false,"hidden":false,"merged":[[0,0,0,5],[1,0,1,5]]}
["PRIORIZACIÓN DE TRÁMITES ADMINISTRATIVOS"]
["COSTOS PARA LA ADMINISTRACIÓN PÚBLICA"]
[]
["IDENTIFICADOR","TRÁMITE","COSTO PARA LA ADM. PÚBLICA","PUNTUACIÓN"]
["MH-019-01-04","Actualización de licencia personal en materia de seguridad radiológica",245.86,5]
["MH-011-01-01","Aprobación de las tasas de producción de petróleo por pozo y yacimiento",245.86,5]
["MH-006-01-03","Aprobación de reacondicionamientos de pozos productores hidrocarburiferos, inyectores o re inyectores",245.86,5]
["MH-008-01-03","Aprobación de taponamiento y abandono definitivo de pozos",245.86,5]
["MH-008-01-04","Aprobación de taponamiento y abandono temporal de pozos",245.86,5]
["MH-005-01-01","Atención de solicitudes de acceso a la información pública",245.86,5]
["MH-040-01-01","Autorización Temporal de Libre Aprovechamiento de Materiales de Construcción Para Obras Públicas Para Entidades Gubernamentales",245.86,5]
["MH-021-01-03","Calibración de detectores por cada escala adicional en planta central",245.86,5]
["MH-021-01-06","Calibración de detectores por cada escala adicional fuera de planta central",245.86,5]
["MERNNR-029-04-01","Emisión de autorización de movilización de fuentes radiactivas",245.86,5]
["MERNNR-029-03-02","Emisión de autorización de re-exportación de equipos generadores de radiación ionizante",245.86,5]
["MH-019-02-04","Emisión de licencia institucional para fuentes selladas",245.86,5]
["MH-019-02-01","Emisión licencia institucional para equipos generadores de radiación ionizante para uso médico",245.86,5]
["MERNNR-024-03-01","Monitoreo de niveles de radiactividad natural o artificial",245.86,5]
["MH-013-01-01","Notificación del inicio de programas de actividad sísmica",245.86,5]
["MH-037-01-02","Otorgamiento de Autorización para la Instalación y Operación de Plantas de Beneficio, Fundición, Refinación y Construcción de Relaveras Para Personas Jurídicas",245.86,5]
{"$rows_left_out":133}
{"sheet":"AUXILIAR COSTO ADMINISTRACIÓN","index":5,"n_rows":20,"n_cols":3,"rows_kept":20,"cut":false,"hidden":false,"merged":[[1,1,1,2]]}
[]
["TRÁMITE:"]
["NO.","ACTIVIDAD","TIEMPO (HORAS)"]
[1,"a.- Recepción de trámites e ingreso al sistema de gestión documental QUIPUX",0.15]
[2,"b.- Análisis técnico y legal de la solicitud, documentos habilitantes",6]
[3,"c.- Solicitud de informes a la Agencia de Regulación y Control Minero.",1]
[4,"d.- Validación de los informes técnico, económico, catastral y/o legal.",6]
[5,"e.- Verificación  de procedencia desde la Subsecretaría de Minería Artesanal y Pequeña Minería",6]
[6,"f.- Emisión de la Resolución y archivo del expediente.",5]
[7]
[8]
[9]
[10]
[11]
[12]
[13]
[14]
[15]
[]
[null,"SUMATORIA ACTIVIDADES",{"$f":"SUM(C4:C19)","v":24.15}]
{"$rows_left_out":1}
{"sheet":"TIEMPO DE RESPUESTA","index":6,"n_rows":152,"n_cols":4,"rows_kept":152,"cut":false,"hidden":false,"merged":[[0,0,0,3],[1,0,1,3]]}
["PRIORIZACIÓN DE TRÁMITES ADMINISTRATIVOS"]
["TIEMPO DE RESPUESTA"]
[]
["IDENTIFICADOR","TRÁMITE","TIEMPO RESPUESTA (horas laborables)","PUNTUACIÓN"]
["MH-042-02-01","Acumulación de Áreas de Régimen de Minería Artesanal Para la Modificación a Régimen de Pequeña Minería",600,30]
["MH-043-01-01","Acumulación de Áreas Mineras",600,30]
["MH-054-01-01","Ampliación de Evaluación Económica del Yacimiento de Concesiones de Mediana / Gran Minería",480,30]
["MH-025-02-02","Análisis de PCBs en aceite dieléctrico, empresa particular",40,0]
["MH-025-02-03","Análisis de PCBs en aceite dieléctrico, empresas eléctricas",80,30]
["MH-025-03-02","Análisis de residuos de glifosato en suelo o agua",40,0]
["MH-025-01-01","Análisis de residuos de hidrocarburos aromáticos policíclicos HAPs en agua o suelo",40,0]
["MH-025-03-01","Análisis de residuos de OCls y OPs por cromatografía de gases, en biotas, suelo o agua",40,0]
["MH-025-02-01","Análisis de residuos de PCBs en agua o suelo",40,0]
["MH-024-01-03","Análisis de tritio en muestras acuosas",120,30]
["MH-007-01-02","Aprobación de construcción de nuevas facilidades, ampliación, mejoramiento y o modificación de facilidades existentes. (actividades que no se encuentran dentro del presupuesto anual aprobado)",240,30]
["MERNNR-068-01-01","Aprobación de la caracterización de yacimientos por campo",360,30]
["MERNNR-067-01-02","Aprobación de la prolongación de Pruebas de Inyección de fluidos",240,30]
["MERNNR-067-01-03","Aprobación de la prolongación de Pruebas de Reinyección de fluidos",240,30]
["MERNNR-015-02-02","Aprobación de la reforma al programas de actividades y presupuestos de inversiones, costos y gastos anuales para empresas privadas",720,30]
["MERNNR-058-01-02","Aprobación de perforación de pozos de re-entry",120,30]
{"$rows_left_out":133}
{"sheet":"CANAL ATENCIÓN","index":7,"n_rows":189,"n_cols":12,"rows_kept":189,"cut":false,"hidden":false,"merged":[[0,0,0,3],[1,0,1,3]]}
["PRIORIZACIÓN DE TRÁMITES ADMINISTRATIVOS"]
["CANAL DE ATENCIÓN"]
[null,null,null,null,null,null,null,null,"Totalmente en Línea",null,null,0]
["IDENTIFICADOR","TRÁMITE","CANAL ATENCIÓN","PUNTUACIÓN",null,null,null,null,"No se completa totalmente en línea.",null,null,10]
["MH-042-02-01","Acumulación de Áreas de Régimen de Minería Artesanal Para la Modificación a Régimen de Pequeña Minería","No se completa totalmente en línea.",{"$f":"IF(ISBLANK(C5),\"\",IF(C5=\"Totalmente en línea\",0,IF(C5=\"Inicia en línea\",6,10)))","v":10}]
["MH-043-01-01","Acumulación de Áreas Mineras","No se completa totalmente en línea.",{"$f":"IF(ISBLANK(C6),\"\",IF(C6=\"Totalmente en línea\",0,IF(C6=\"Inicia en línea\",6,10)))","v":10}]
["MH-054-01-01","Ampliación de Evaluación Económica del Yacimiento de Concesiones de Mediana / Gran Minería","No se completa totalmente en línea.",10]
["MH-025-02-02","Análisis de PCBs en aceite dieléctrico, empresa particular","No se completa totalmente en línea.",10]
["MH-025-02-03","Análisis de PCBs en aceite dieléctrico, empresas eléctricas","No se completa totalmente en línea.",10]
["MH-025-03-02","Análisis de residuos de glifosato en suelo o agua","No se completa totalmente en línea.",10]
["MH-025-01-01","Análisis de residuos de hidrocarburos aromáticos policíclicos HAPs en agua o suelo","No se completa totalmente en línea.",10]
["MH-025-03-01","Análisis de residuos de OCls y OPs por cromatografía de gases, en biotas, suelo o agua","No se completa totalmente en línea.",10]
["MH-025-02-01","Análisis de residuos de PCBs en agua o suelo","No se completa totalmente en línea.",10]
["MH-024-01-03","Análisis de tritio en muestras acuosas","No se completa totalmente en línea.",10]
["MH-007-01-02","Aprobación de construcción de nuevas facilidades, ampliación, mejoramiento y o modificación de facilidades existentes. (actividades que no se encuentran dentro del presupuesto anual aprobado)","No se completa totalmente en línea.",10]
["MERNNR-068-01-01","Aprobación de la caracterización de yacimientos por campo","No se completa totalmente en línea.",10]
["MERNNR-067-01-02","Aprobación de la prolongación de Pruebas de Inyección de fluidos","No se completa totalmente en línea.",10]
["MERNNR-067-01-03","Aprobación de la prolongación de Pruebas de Reinyección de fluidos","No se completa totalmente en línea.",10]
["MERNNR-015-02-02","Aprobación de la reforma al programas de actividades y presupuestos de inversiones, costos y gastos anuales para empresas privadas","No se completa totalmente en línea.",10]
["MERNNR-058-01-02","Aprobación de perforación de pozos de re-entry","No se completa totalmente en línea.",10]
{"$rows_left_out":170}
{"sheet":"RESUMEN","index":8,"n_rows":164,"n_cols":25,"rows_kept":164,"cut":false,"hidden":false,"merged":[[1,0,2,0],[1,1,2,1],[1,2,2,2],[1,3,2,3],[1,4,2,4],[1,9,1,10],[1,11,1,12],[1,13,2,13],[0,2,0,6],[0,7,0,12],[1,5,2,5],[1,6,2,6],[1,7,1,8]]}
[null,null,"BÁSICOS",null,null,null,null,"ADICIONALES"]
["ID trámite","Nombre del trámite","Demanda","Quejas","Costo para administración","Tiempo de respuesta","Canal de atención","Necesidades ciudadanas",null,"Susceptibilidad a corrupción",null,"Volumen de devoluciones",null,"PUNTAJE TOTAL"]
[null,null,null,null,null,null,null,"Criterio","Puntuación","Criterio","Puntuación","Criterio","Puntuación",null,null,null,null,null,null,null,"demanda",0,3,6,10]
["MH-042-02-01","Acumulación de Áreas de Régimen de Minería Artesanal Para la Modificación a Régimen de Pequeña Minería",0,0,{"$f":"VLOOKUP(A4,'RESUMEN DE COSTOS AP'!$A$5:$D$152,4,FALSE)","v":5},30,10,"NO",{"$f":"IF(H4=\"SI\",5,0)","v":0},"NO",{"$f":"IF(J4=\"SI\",10,0)","v":0},"NO",{"$f":"IF(L4=\"SI\",5,0)","v":0},{"$f":"SUM(C4:G4,I4,K4,M4)","v":45},null,null,null,null,null,null,"quejas",0,4,10]
["MH-043-01-01","Acumulación de Áreas Mineras",0,0,{"$f":"VLOOKUP(A5,'RESUMEN DE COSTOS AP'!$A$5:$D$152,4,FALSE)","v":5},30,10,"NO",{"$f":"IF(H5=\"SI\",5,0)","v":0},"NO",{"$f":"IF(J5=\"SI\",10,0)","v":0},"NO",{"$f":"IF(L5=\"SI\",5,0)","v":0},{"$f":"SUM(C5:G5,I5,K5,M5)","v":45}]
["MH-054-01-01","Ampliación de Evaluación Económica del Yacimiento de Concesiones de Mediana / Gran Minería",0,0,{"$f":"VLOOKUP(A6,'RESUMEN DE COSTOS AP'!$A$5:$D$152,4,FALSE)","v":20},30,10,"NO",0,"NO",0,"NO",0,60]
["MH-025-02-02","Análisis de PCBs en aceite dieléctrico, empresa particular",0,0,{"$f":"VLOOKUP(A7,'RESUMEN DE COSTOS AP'!$A$5:$D$152,4,FALSE)","v":10},0,10,"NO",0,"NO",0,"NO",0,20]
["MH-025-02-03","Análisis de PCBs en aceite dieléctrico, empresas eléctricas",0,0,{"$f":"VLOOKUP(A8,'RESUMEN DE COSTOS AP'!$A$5:$D$152,4,FALSE)","v":20},30,10,"NO",0,"NO",0,"NO",0,60]
["MH-025-03-02","Análisis de residuos de glifosato en suelo o agua",0,0,{"$f":"VLOOKUP(A9,'RESUMEN DE COSTOS AP'!$A$5:$D$152,4,FALSE)","v":5},0,10,"NO",0,"NO",0,"NO",0,15]
["MH-025-01-01","Análisis de residuos de hidrocarburos aromáticos policíclicos HAPs en agua o suelo",0,0,{"$f":"VLOOKUP(A10,'RESUMEN DE COSTOS AP'!$A$5:$D$152,4,FALSE)","v":20},0,10,"NO",0,"NO",0,"NO",0,30]
["MH-025-03-01","Análisis de residuos de OCls y OPs por cromatografía de gases, en biotas, suelo o agua",0,0,{"$f":"VLOOKUP(A11,'RESUMEN DE COSTOS AP'!$A$5:$D$152,4,FALSE)","v":10},0,10,"NO",0,"NO",0,"NO",0,20]
["MH-025-02-01","Análisis de residuos de PCBs en agua o suelo",0,0,{"$f":"VLOOKUP(A12,'RESUMEN DE COSTOS AP'!$A$5:$D$152,4,FALSE)","v":5},0,10,"NO",0,"NO",0,"NO",0,15]
["MH-024-01-03","Análisis de tritio en muestras acuosas",0,0,{"$f":"VLOOKUP(A13,'RESUMEN DE COSTOS AP'!$A$5:$D$152,4,FALSE)","v":5},30,10,"NO",0,"NO",0,"NO",0,45]
["MH-007-01-02","Aprobación de construcción de nuevas facilidades, ampliación, mejoramiento y o modificación de facilidades existentes. (actividades que no se encuentran dentro del presupuesto anual aprobado)",0,0,{"$f":"VLOOKUP(A14,'RESUMEN DE COSTOS AP'!$A$5:$D$152,4,FALSE)","v":5},30,10,"NO",0,"NO",0,"NO",0,45]
["MERNNR-068-01-01","Aprobación de la caracterización de yacimientos por campo",0,0,{"$f":"VLOOKUP(A15,'RESUMEN DE COSTOS AP'!$A$5:$D$152,4,FALSE)","v":5},30,10,"NO",0,"NO",0,"NO",0,45]
["MERNNR-067-01-02","Aprobación de la prolongación de Pruebas de Inyección de fluidos",0,0,{"$f":"VLOOKUP(A16,'RESUMEN DE COSTOS AP'!$A$5:$D$152,4,FALSE)","v":5},30,10,"NO",0,"NO",0,"NO",0,45]
["MERNNR-067-01-03","Aprobación de la prolongación de Pruebas de Reinyección de fluidos",0,0,{"$f":"VLOOKUP(A17,'RESUMEN DE COSTOS AP'!$A$5:$D$152,4,FALSE)","v":5},30,10,"NO",0,"NO",0,"NO",0,45]
["MERNNR-015-02-02","Aprobación de la reforma al programas de actividades y presupuestos de inversiones, costos y gastos anuales para empresas privadas",0,0,{"$f":"VLOOKUP(A18,'RESUMEN DE COSTOS AP'!$A$5:$D$152,4,FALSE)","v":10},30,10,"NO",0,"NO",0,"NO",0,50]
["MERNNR-058-01-02","Aprobación de perforación de pozos de re-entry",0,0,{"$f":"VLOOKUP(A19,'RESUMEN DE COSTOS AP'!$A$5:$D$152,4,FALSE)","v":20},30,10,"NO",0,"NO",0,"NO",0,60]
["MERNNR-015-02-01","Aprobación de programas de actividades y presupuestos de inversiones, costos, gastos anuales para empresas privadas",0,0,{"$f":"VLOOKUP(A20,'RESUMEN DE COSTOS AP'!$A$5:$D$152,4,FALSE)","v":10},30,10,"NO",0,"NO",0,"NO",0,50]
{"$rows_left_out":144}